1 ###########################################################################
   2 #
   3 # Copyright 2009 Sun Microsystems, Inc.  All Rights Reserved.
   4 # DO NOT ALTER OR REMOVE COPYRIGHT NOTICES OR THIS FILE HEADER.
   5 #
   6 # This code is free software; you can redistribute it and/or modify it
   7 # under the terms of the GNU General Public License version 2 only, as
   8 # published by the Free Software Foundation.  Sun designates this
   9 # particular file as subject to the "Classpath" exception as provided
  10 # by Sun in the LICENSE file that accompanied this code.
  11 #
  12 # This code is distributed in the hope that it will be useful, but WITHOUT
  13 # ANY WARRANTY; without even the implied warranty of MERCHANTABILITY or
  14 # FITNESS FOR A PARTICULAR PURPOSE.  See the GNU General Public License
  15 # version 2 for more details (a copy is included in the LICENSE file that
  16 # accompanied this code).
  17 #
  18 # You should have received a copy of the GNU General Public License version
  19 # 2 along with this work; if not, write to the Free Software Foundation,
  20 # Inc., 51 Franklin St, Fifth Floor, Boston, MA 02110-1301 USA.
  21 #
  22 # Please contact Sun Microsystems, Inc., 4150 Network Circle, Santa Clara,
  23 # CA 95054 USA or visit www.sun.com if you need additional information or
  24 # have any questions.
  25 #
  26 ###########################################################################
  27 #
  28 # List of tests that should not be run by test/Makefile, for various reasons:
  29 #   1. Does not run with jtreg -samevm mode
  30 #   2. Causes problems in jtreg -samevm mode for jtreg or tests that follow it
  31 #   3. The test is too slow or consumes too many system resources
  32 #   4. The test fails when run on any official build systems
  33 #
  34 # It is possible that a test being on this list is a mistake, and that some
  35 #   other test in samevm mode caused tests to fail, mistakes happen.
  36 #
  37 # Tests marked @ignore are not run by test/Makefile, but harmless to be listed.
  38 #
  39 # Tests that explicitly state "@run main/othervm ...", and are not listed here,
  40 #   will be run in the same batch as the samevm tests.
  41 #
  42 # Shell tests are othervm by default.
  43 #
  44 # List items  are testnames followed by labels, all MUST BE commented 
  45 #   as to why they are here and use a label:
  46 #     generic-all       Problems on all platforms
  47 #     generic-ARCH      Where ARCH is one of: sparc, sparcv9, x64, i586, etc.
  48 #     OSNAME-all        Where OSNAME is one of: solaris, linux, windows
  49 #     OSNAME-ARCH       Specific on to one OSNAME and ARCH, e.g. solaris-x64
  50 #     OSNAME-REV        Specific on to one OSNAME and REV, e.g. solaris-5.8
  51 #        
  52 # More than one label is allowed but must be on the same line.
  53 #
  54 #############################################################################
  55 #
  56 # Running the tests:
  57 #    cd test && make JT_HOME=jtreg_home PRODUCT_HOME=jdk_home jdk_all
  58 #  Or instead of jdk_all, use any of the jdk_* targets.
  59 #
  60 # Samevm Notes:
  61 #  * Although some tests may have only been seen to fail on some platforms,
  62 #    they might be flagged as 'generic-all' because the problem they have
  63 #    could cause hidden slowdowns on other platforms.
  64 #    Most samevm problems will be generic-all, but windows usually dislikes
  65 #    them the most.
  66 #    Address already in use or connection errors indicate a generic port issue.
  67 #    (this is not necessarily a samevm issue, but an issue for running the tests
  68 #     on shared machines, two people or two test runs will collide).
  69 #  * Samevm problem (windows in particular) is not closing all input/output
  70 #  * Samevm problem when a test calls setSecurityManager()
  71 #  * Samevm problem with setHttps*() is used? (not exactly sure here)
  72 #  * Samevm problem when stuffing system properties with non Strings or anything
  73 #  * Samevm problem when changing vm settings, or registering any vm actions
  74 #  * Samevm problems with deleteOnExit(), if it must happen at end of test
  75 #  * Samevm problems with URLClassLoader? (no details here)
  76 #  * Samevm problems with dependence on predictable GC or finalizations
  77 #
  78 # Any of the above problems may mean the test needs to be flagged as "othervm".
  79 #
  80 #############################################################################
  81 #
  82 # Fixing the tests:
  83 #
  84 # Some tests just may need to be run with "othervm", and that can easily be
  85 #   done my adding a @run line (or modifying any existing @run):
  86 #      @run main/othervm NameOfMainClass
  87 #   Make sure this @run follows any use of @library.
  88 #   Otherwise, if the test is a samevm possibility, make sure the test is
  89 #     cleaning up after itself, closing all streams, deleting temp files, etc.
  90 #
  91 # Keep in mind that the bug could be in many places, and even different per
  92 #   platform, it could be a bug in any one of:
  93 #      - the testcase
  94 #      - the jdk (jdk classes, native code, or hotspot)
  95 #      - the native compiler
  96 #      - the javac compiler
  97 #      - the OS (depends on what the testcase does)
  98 #
  99 # If you managed to really fix one of these tests, here is how you can
 100 #    remove tests from this list:
 101 #  1. Make sure test passes on all platforms with samevm, or mark it othervm
 102 #  2. Make sure test passes on all platforms when run with it's entire group
 103 #  3. Make sure both VMs are tested, -server and -client, if possible
 104 #  4. Make sure you try the -d64 option on Solaris
 105 #  5. Use a tool like JPRT or something to verify these results
 106 #  6. Delete lines in this file, include the changes with your test changes
 107 #
 108 # You may need to repeat your testing 2 or even 3 times to verify good
 109 #   results, some of these samevm failures are not very predictable.
 110 #
 111 #############################################################################
 112 
 113 ############################################################################
 114 
 115 # jdk_awt
 116 
 117 # None of the awt tests are using samevm, might not be worth the effort due
 118 #  to the vm overhead not being enough to make a difference.
 119 # In general, the awt tests are problematic with or without samevm, and there
 120 #  are issues with using a Xvfb display.
 121 
 122 # Fails on solaris sparc, timedout? in othervm mode
 123 java/awt/event/MouseEvent/AcceptExtraButton/AcceptExtraButton.java generic-all
 124 
 125 # Causes hang in samevm mode??? Solaris 11 i586
 126 java/awt/FullScreen/SetFSWindow/FSFrame.java                    generic-all
 127 
 128 # Fails on solaris 11 i586, -client, in othervm mode not sure why
 129 java/awt/Component/PrintAllXcheckJNI/PrintAllXcheckJNI.java     generic-all
 130 java/awt/Focus/CloseDialogActivateOwnerTest/CloseDialogActivateOwnerTest.java generic-all
 131 java/awt/FontClass/FontAccess.java                              generic-all
 132 java/awt/Mixing/HWDisappear.java                                generic-all
 133 java/awt/Mixing/MixingInHwPanel.java                            generic-all
 134 java/awt/Mouse/MaximizedFrameTest/MaximizedFrameTest.html       generic-all
 135 java/awt/Robot/AcceptExtraMouseButtons/AcceptExtraMouseButtons.java generic-all
 136 java/awt/Toolkit/SecurityTest/SecurityTest2.java                generic-all
 137 java/awt/image/mlib/MlibOpsTest.java                            generic-all
 138 
 139 # Fails on windows, othervm mode, various errors
 140 java/awt/Focus/NonFocusableWindowTest/NonfocusableOwnerTest.java        generic-all
 141 java/awt/Focus/OwnedWindowFocusIMECrashTest/OwnedWindowFocusIMECrashTest.java   generic-all
 142 java/awt/FullScreen/NoResizeEventOnDMChangeTest/NoResizeEventOnDMChangeTest.java        generic-all
 143 java/awt/Mouse/MouseModifiersUnitTest/MouseModifiersUnitTest_Standard.java      generic-all
 144 java/awt/event/KeyEvent/KeyTyped/CtrlASCII.html                 generic-all
 145 java/awt/font/Threads/FontThread.java                           generic-all
 146 java/awt/print/PrinterJob/PrtException.java                     generic-all
 147 
 148 # Fails with windows X64, othervm, -server
 149 com/sun/awt/Translucency/WindowOpacity.java                     generic-all
 150 java/awt/EventDispatchThread/HandleExceptionOnEDT/HandleExceptionOnEDT.java             generic-all
 151 java/awt/EventDispatchThread/LoopRobustness/LoopRobustness.html generic-all
 152 java/awt/Focus/AppletInitialFocusTest/AppletInitialFocusTest1.html generic-all
 153 java/awt/Focus/FocusEmbeddedFrameTest/FocusEmbeddedFrameTest.java generic-all
 154 java/awt/Frame/LayoutOnMaximizeTest/LayoutOnMaximizeTest.java   generic-all
 155 java/awt/FullScreen/TranslucentWindow/TranslucentWindow.java    generic-all
 156 java/awt/Mixing/MixingOnShrinkingHWButton.java                  generic-all
 157 java/awt/Mouse/MouseModifiersUnitTest/ExtraButtonDrag.java      generic-all
 158 
 159 ############################################################################
 160 
 161 # jdk_beans
 162 
 163 # A large set of the beans tests set the security manager, which would seem
 164 #  to indicate that a large number of them should be "othervm", yet are all
 165 #  very small tests and could greatly benefit from a samevm test run.
 166 #  So a large batch of beans tests are currently run with othervm mode.
 167 
 168 # Linux, some kind of problems with X11 display
 169 java/beans/PropertyChangeSupport/Test4682386.java               generic-all
 170 java/beans/PropertyChangeSupport/TestSynchronization.java       generic-all
 171 java/beans/Statement/Test4653179.java                           generic-all
 172 
 173 # Runs REALLY slow on Solaris sparc for some reason, both -client and -server
 174 java/beans/XMLEncoder/Test4625418.java                          solaris-sparc
 175 
 176 # Problems with samevm and setting security manager (speculation partially)
 177 java/beans/Beans/Test4080522.java                               generic-all
 178 java/beans/EventHandler/Test6277246.java                        generic-all
 179 java/beans/EventHandler/Test6277266.java                        generic-all
 180 java/beans/Introspector/Test6277246.java                        generic-all
 181 java/beans/Introspector/4168475/Test4168475.java                generic-all
 182 java/beans/Introspector/4520754/Test4520754.java                generic-all
 183 java/beans/Introspector/6380849/TestBeanInfo.java               generic-all
 184 java/beans/Introspector/Test4144543.java                        generic-all
 185 
 186 # Failed to call method solaris-sparc???
 187 java/beans/EventHandler/Test6788531.java                        generic-all
 188 
 189 # Jar or class not found???
 190 java/beans/XMLEncoder/6329581/Test6329581.java                  generic-all
 191 
 192 ############################################################################
 193 
 194 # jdk_io
 195 
 196 # Many of these tests have a tendency to leave input streams open, which
 197 #  will cause following tests to be failures when used in samevm mode.
 198 
 199 # Should be othervm, or corrected for samevm, fails with samevm:
 200 java/io/BufferedReader/BigMark.java                             generic-all
 201 java/io/BufferedReader/ReadLineSync.java                        generic-all
 202 
 203 # One of these is leaving "a.ser" file open, windows samevm
 204 java/io/Serializable/duplicateSerialFields/Setup.java           generic-all
 205 java/io/Serializable/duplicateSerialFields/Test.java            generic-all
 206 
 207 # One of these leaving foo.ser open, windows samevm problem
 208 java/io/Serializable/enum/constantSubclasses/Read.java          generic-all
 209 java/io/Serializable/enum/constantSubclasses/Write.java         generic-all
 210 java/io/Serializable/enum/missingConstant/Read.java             generic-all
 211 java/io/Serializable/enum/missingConstant/Write.java            generic-all
 212 
 213 # This is leaving subtest1.tmp open, windows samevm problem
 214 java/io/Serializable/oldTests/AnnotateClass.java                generic-all
 215 
 216 # One or more of these leave a piotest* file open, windows samevm
 217 java/io/Serializable/oldTests/ArrayFields.java                  generic-all
 218 java/io/Serializable/oldTests/ArraysOfArrays.java               generic-all
 219 java/io/Serializable/oldTests/BinaryTree.java                   generic-all
 220 java/io/Serializable/oldTests/CircularList.java                 generic-all
 221 java/io/Serializable/oldTests/SerializeWithException.java       generic-all
 222 java/io/Serializable/oldTests/SimpleArrays.java                 generic-all
 223 java/io/Serializable/oldTests/WritePrimitive.java               generic-all
 224 
 225 # Missing close on file 0.ser, windows samevm
 226 java/io/Serializable/enum/badResolve/Read.java                  generic-all
 227 java/io/Serializable/enum/badResolve/Write.java                 generic-all
 228 
 229 # One of these tests is leaving parents.ser open, windows samevm
 230 java/io/Serializable/parents/EvolvedClass.java                  generic-all
 231 java/io/Serializable/parents/OriginalClass.java                 generic-all
 232 
 233 # One of these tests is leaving file foo.ser and/or bar.ser open, windows samevm
 234 java/io/Serializable/fieldTypeString/Read.java                  generic-all
 235 java/io/Serializable/fieldTypeString/Write.java                 generic-all
 236 
 237 # One of these tests is leaving tmp.ser file open, windows samevm
 238 java/io/Serializable/ClassCastExceptionDetail/Read.java         generic-all
 239 java/io/Serializable/ClassCastExceptionDetail/Write.java        generic-all
 240 java/io/Serializable/GetField/Read.java                         generic-all
 241 java/io/Serializable/GetField/Read2.java                        generic-all
 242 java/io/Serializable/GetField/Write.java                        generic-all
 243 java/io/Serializable/PutField/Read.java                         generic-all
 244 java/io/Serializable/PutField/Read2.java                        generic-all
 245 java/io/Serializable/PutField/Write.java                        generic-all
 246 java/io/Serializable/PutField/Write2.java                       generic-all
 247 java/io/Serializable/arraySuidConflict/Read.java                generic-all
 248 java/io/Serializable/arraySuidConflict/Write.java               generic-all
 249 java/io/Serializable/backRefCNFException/Read.java              generic-all
 250 java/io/Serializable/backRefCNFException/Write.java             generic-all
 251 java/io/Serializable/class/Test.java                            generic-all
 252 java/io/Serializable/evolution/AddedExternField/ReadAddedField.java generic-all
 253 java/io/Serializable/evolution/AddedExternField/WriteAddedField.java generic-all
 254 java/io/Serializable/evolution/AddedExternField/run.sh          generic-all
 255 java/io/Serializable/evolution/AddedField/ReadAddedField.java   generic-all
 256 java/io/Serializable/evolution/AddedField/WriteAddedField.java  generic-all
 257 java/io/Serializable/evolution/AddedSuperClass/ReadAddedSuperClass.java generic-all
 258 java/io/Serializable/evolution/AddedSuperClass/ReadAddedSuperClass2.java generic-all
 259 java/io/Serializable/evolution/AddedSuperClass/WriteAddedSuperClass.java generic-all
 260 java/io/Serializable/proxy/skipMissing/Read.java                generic-all
 261 java/io/Serializable/proxy/skipMissing/Write.java               generic-all
 262 java/io/Serializable/readObjectNoData/Read.java                 generic-all
 263 java/io/Serializable/readObjectNoData/Write.java                generic-all
 264 java/io/Serializable/skipWriteObject/Read.java                  generic-all
 265 java/io/Serializable/skipWriteObject/Write.java                 generic-all
 266 java/io/Serializable/skippedObjCNFException/Read.java           generic-all
 267 java/io/Serializable/skippedObjCNFException/Write.java          generic-all
 268 java/io/Serializable/stopCustomDeserialization/Read.java        generic-all
 269 java/io/Serializable/stopCustomDeserialization/Write.java       generic-all
 270 java/io/Serializable/unresolvedClassDesc/Read.java              generic-all
 271 java/io/Serializable/unresolvedClassDesc/Write.java             generic-all
 272 java/io/Serializable/unshared/Read.java                         generic-all
 273 java/io/Serializable/unshared/Write.java                        generic-all
 274 java/io/Serializable/wrongReturnTypes/Read.java                 generic-all
 275 java/io/Serializable/wrongReturnTypes/Write.java                generic-all
 276 
 277 # Windows samevm issues? triggers other tests to fail, missing close() on f.txt?
 278 java/io/DataInputStream/OpsAfterClose.java                      generic-all
 279 
 280 # Windows 32bit samevm failure: RuntimeException: File.getFreeSpace() failed
 281 java/io/File/MaxPathLength.java                                 generic-all
 282 
 283 # Should be othervm, or corrected for samevm, fails with samevm:
 284 java/io/File/DeleteOnExit.java                                  generic-all
 285 java/io/File/DeleteOnExitLong.java                              generic-all
 286 java/io/File/DeleteOnExitNPE.java                               generic-all
 287 java/io/File/IsHidden.java                                      generic-all
 288 java/io/FileDescriptor/FileChannelFDTest.java                   generic-all
 289 java/io/FileDescriptor/Finalize.java                            generic-all
 290 java/io/FileInputStream/FinalizeShdCallClose.java               generic-all
 291 
 292 # Known to cause samevm issues on windows, other tests fail, missing close()?
 293 java/io/FileInputStream/OpsAfterClose.java                      generic-all
 294 
 295 # Should be othervm, or corrected for samevm, fails with samevm:
 296 java/io/FileOutputStream/FinalizeShdCallClose.java              generic-all
 297 
 298 # Known to cause samevm issues on windows, other tests fail, missing close()?
 299 java/io/FileOutputStream/OpsAfterClose.java                     generic-all
 300 
 301 # Windows samevm issues? triggers other tests to fail, missing close() on f.txt?
 302 java/io/InputStream/OpsAfterClose.java                          generic-all
 303 
 304 # Missing close() on x.ReadBounds file? Windows samevm issues
 305 java/io/InputStream/ReadParams.java                             generic-all
 306 
 307 # Known to cause samevm issues on windows, other tests fail, missing close()?
 308 java/io/InputStreamReader/GrowAfterEOF.java                     generic-all
 309 
 310 # Should be othervm, or corrected for samevm, fails with samevm:
 311 java/io/ObjectInputStream/ResolveProxyClass.java                generic-all
 312 
 313 # Not doing a close() on x.ParameterCheck file? windows samevm cascade error
 314 java/io/RandomAccessFile/ParameterCheck.java                    generic-all
 315 
 316 # Not doing a close on x.ReadLine file? windows cascade samevm problems
 317 java/io/RandomAccessFile/ReadLine.java                          generic-all
 318 
 319 # Not doing close on file input x.WriteByteChars, windows samevm problems
 320 java/io/RandomAccessFile/WriteBytesChars.java                   generic-all
 321 
 322 # Not doing close on file input x.WriteUTF, windows samevm problems
 323 java/io/RandomAccessFile/WriteUTF.java                          generic-all
 324 
 325 # Possibly, not doing a close() on input.txt, windows samevm issues.
 326 java/io/RandomAccessFile/skipBytes/SkipBytes.java               generic-all
 327 java/io/readBytes/MemoryLeak.java                               generic-all
 328 java/io/readBytes/ReadBytesBounds.java                          generic-all 
 329 
 330 # Missing close on fields.ser, windows samevm
 331 java/io/Serializable/checkModifiers/CheckModifiers.java         generic-all
 332 
 333 # Should be othervm, or corrected for samevm, fails with samevm:
 334 java/io/Serializable/auditStreamSubclass/AuditStreamSubclass.java generic-all
 335 java/io/Serializable/proxy/Basic.java                           generic-all
 336 
 337 # Possibly not doing a close() on input.txt, windows samevm issues.
 338 java/io/StreamTokenizer/Comment.java                            generic-all
 339 
 340 ############################################################################
 341 
 342 # jdk_lang
 343 
 344 # Some of these tests (like java/lang/management) may just need to be marked
 345 #   othervm, but that is partially speculation.
 346 
 347 # Samevm failure on OpenSolaris, security manager?
 348 java/lang/ClassLoader/UninitializedParent.java                  generic-all
 349 
 350 # Times out on solaris 10 sparc
 351 java/lang/ClassLoader/Assert.java                               generic-all
 352 
 353 # Fedora 9 X64, RuntimeException: MyThread expected to be blocked on lock, but got null
 354 java/lang/management/ThreadMXBean/ThreadStateTest.java          generic-all
 355 
 356 # RuntimeException: Uptime of the JVM is more than 30 minutes (32 minutes).
 357 java/lang/management/RuntimeMXBean/UpTime.java                  generic-all
 358 
 359 # Times out on solaris sparc occasionally, in samevm mode
 360 java/lang/Runtime/exec/ExecWithDir.java                         generic-all
 361 java/lang/ProcessBuilder/Basic.java                             generic-all
 362 
 363 # Solaris sparc, samevm, java.lang.Exception: Read from closed pipe hangs
 364 java/lang/Runtime/exec/SleepyCat.java                           generic-all
 365 
 366 # Need to be marked othervm, or changed to be samevm safe
 367 java/lang/annotation/ParameterAnnotations.java                  generic-all
 368 
 369 # Need to be marked othervm, or changed to be samevm safe
 370 java/lang/ClassLoader/defineClass/DefineClassByteBuffer.java    generic-all
 371 java/lang/ClassLoader/findSystemClass/Loader.java               generic-all
 372 
 373 # Fedora 9 32bit, -client, samevm, Error while cleaning up threads after test
 374 java/lang/management/ThreadMXBean/Locks.java                    generic-all
 375 
 376 # Need to be marked othervm, or changed to be samevm safe
 377 java/lang/management/ClassLoadingMXBean/LoadCounts.java         generic-all
 378 java/lang/management/ManagementFactory/MBeanServerMXBeanUnsupportedTest.java generic-all
 379 java/lang/management/ManagementFactory/MXBeanProxyTest.java     generic-all
 380 java/lang/management/ManagementFactory/ThreadMXBeanProxy.java   generic-all
 381 java/lang/management/MemoryMXBean/CollectionUsageThreshold.java generic-all
 382 java/lang/management/MemoryMXBean/GetMBeanInfo.java             generic-all
 383 java/lang/management/MemoryMXBean/LowMemoryTest.java            generic-all
 384 java/lang/management/MemoryMXBean/MemoryManagement.java         generic-all
 385 java/lang/management/MemoryMXBean/MemoryTest.java               generic-all
 386 java/lang/management/MemoryMXBean/Pending.java                  generic-all
 387 
 388 # Problematic on all platforms (even as othervm)
 389 java/lang/management/MemoryMXBean/ResetPeakMemoryUsage.java     generic-all
 390 
 391 # Causes jtreg exit samevm issues due to non-String object in system properties
 392 java/lang/management/RuntimeMXBean/GetSystemProperties.java     generic-all
 393 
 394 # Need to be marked othervm, or changed to be samevm safe
 395 java/lang/management/RuntimeMXBean/PropertiesTest.java          generic-all
 396 java/lang/management/ThreadMXBean/AllThreadIds.java             generic-all
 397 java/lang/management/ThreadMXBean/EnableTest.java               generic-all
 398 java/lang/management/ThreadMXBean/FindMonitorDeadlock.java      generic-all
 399 java/lang/management/ThreadMXBean/LockingThread.java            generic-all
 400 java/lang/management/ThreadMXBean/MonitorDeadlock.java          generic-all
 401 java/lang/management/ThreadMXBean/MyOwnSynchronizer.java        generic-all
 402 java/lang/management/ThreadMXBean/SharedSynchronizer.java       generic-all
 403 java/lang/management/ThreadMXBean/SynchronizerLockingThread.java generic-all
 404 java/lang/management/ThreadMXBean/ThreadCounts.java             generic-all
 405 
 406 # Need to be marked othervm, or changed to be samevm safe
 407 java/lang/reflect/Proxy/Boxing.java                             generic-all
 408 java/lang/reflect/Proxy/ClassRestrictions.java                  generic-all
 409 java/lang/reflect/Proxy/returnTypes/Test.java                   generic-all
 410 
 411 # Need to be marked othervm, or changed to be samevm safe
 412 java/lang/Runtime/exec/LotsOfOutput.java                        generic-all
 413 java/lang/System/ExitFinalizersAndJIT.java                      generic-all
 414 java/lang/System/finalization/FinThreads.java                   generic-all
 415 java/lang/System/IgnoreNullSecurityManager.java                 generic-all
 416 java/lang/Thread/GenerifyStackTraces.java                       generic-all
 417 java/lang/Thread/StackTraces.java                               generic-all
 418 java/lang/ThreadGroup/Daemon.java                               generic-all
 419 java/lang/ThreadGroup/NullThreadName.java                       generic-all
 420 
 421 # Times out on solaris sparc -server
 422 java/lang/ThreadLocal/MemoryLeak.java                           solaris-all
 423 
 424 # Windows X64, RuntimeException: MyThread expected to have RUNNABLE but got WAITING
 425 java/lang/Thread/ThreadStateTest.java                           generic-all
 426 
 427 # Timeout on windows 64bit 
 428 java/lang/ClassLoader/deadlock/TestCrossDelegate.sh             generic-all
 429 
 430 ############################################################################
 431 
 432 # jdk_management
 433 
 434 # Solaris 10 sparc, NPE from org.omg.stub.javax.management.remote.rmi._RMIConnectionImpl_Tie._invoke
 435 javax/management/remote/mandatory/threads/ExecutorTest.java     generic-all
 436 
 437 # Linux 32bit Fedora 9, IllegalStateException
 438 javax/management/monitor/RuntimeExceptionTest.java              generic-all
 439 
 440 # Problems with rmi connection, othervm  
 441 javax/management/remote/mandatory/subjectDelegation/SubjectDelegation2Test.java generic-all
 442 
 443 # Fails with port already in use
 444 sun/management/jmxremote/bootstrap/SSLConfigFilePermissionTest.sh generic-all
 445 
 446 # Fails with port already in use
 447 sun/management/jmxremote/bootstrap/RmiRegistrySslTest.sh        generic-all
 448 
 449 # Windows, connection can't last that long
 450 javax/management/eventService/LeaseTest.java                    generic-all
 451 
 452 # Linux othervm, X64, java.lang.Exception: Failed: ratio=102.4027795593753
 453 javax/management/remote/mandatory/notif/ListenerScaleTest.java  generic-all
 454 
 455 # Windows run seems to have triggered a hotspot gc error (see 6801625)
 456 com/sun/management/HotSpotDiagnosticMXBean/DumpHeap.sh          generic-all
 457 
 458 # rmi problem? othervm, java.lang.reflect.UndeclaredThrowableException
 459 javax/management/remote/mandatory/subjectDelegation/SubjectDelegation3Test.java generic-all
 460 
 461 # Linux Fedora 9 32bit NPE in rmi server somehere??? othervm
 462 javax/management/remote/mandatory/notif/NotificationBufferDeadlockTest.java generic-all
 463 
 464 # Times out on solaris sparc, with othervm
 465 javax/management/eventService/AddRemoveListenerTest.java        generic-all
 466 
 467 # Linux i586 and x64 -server, timed out waiting for threads to expire? othervm
 468 javax/management/eventService/EventClientThreadTest.java        generic-all
 469 
 470 # Linux i586 -server, Expected to receive 20, but got 21, othervm
 471 #   Fails on Linux X64 -server 20!=21
 472 javax/management/eventService/FetchingTest.java                 generic-all
 473 
 474 # NPE on windows 2000 i586 -client and -server
 475 javax/management/eventService/CustomForwarderTest.java          windows-all
 476 
 477 # Windows i586 failure, callback did not complete
 478 javax/management/eventService/LeaseManagerDeadlockTest.java     windows-all
 479 
 480 # Port already in use
 481 sun/management/jmxremote/bootstrap/LocalManagementTest.sh       generic-all
 482 
 483 # Failed to initialize connector (also overflowing jtreg io buffers)
 484 sun/management/jmxremote/bootstrap/RmiBootstrapTest.sh          generic-all
 485 sun/management/jmxremote/bootstrap/RmiSslBootstrapTest.sh       generic-all
 486 
 487 # Windows X64, java.lang.IllegalStateException
 488 javax/management/monitor/AttributeArbitraryDataTypeTest.java    generic-all
 489 
 490 ############################################################################
 491 
 492 # jdk_math
 493 
 494 # Problems with rounding add failures on solaris-sparcv9 and -server
 495 java/math/BigDecimal/AddTests.java                              solaris-sparcv9
 496 
 497 # Problems on windows with samevm, missing inputstream close()?
 498 # Also times out on solaris-sparcv9 -server
 499 java/math/BigInteger/BigIntegerTest.java                        generic-all
 500 
 501 # Should be samevm? But seems problematic with samevm on windows
 502 java/math/BigInteger/ModPow65537.java                           generic-all
 503 
 504 ############################################################################
 505 
 506 # jdk_misc
 507 
 508 # On Windows com.sun.java.swing.plaf.gtk does not exist, always fails there
 509 com/sun/java/swing/plaf/gtk/Test6635110.java                    windows-all
 510 
 511 # Need to be marked othervm, or changed to be samevm safe
 512 com/sun/jndi/ldap/ReadTimeoutTest.java                          generic-all
 513 com/sun/jndi/rmi/registry/RegistryContext/UnbindIdempotent.java generic-all
 514 
 515 # Need to be marked othervm, or changed to be samevm safe
 516 com/sun/org/apache/xml/internal/security/transforms/ClassLoaderTest.java generic-all
 517 
 518 # Solaris sparc and others, exception in initializer
 519 javax/imageio/CachePremissionsTest/CachePermissionsTest.java    generic-all
 520 
 521 # Leaves file rgba_* open, fails with windows samevm
 522 javax/imageio/plugins/png/PngOutputTypeTest.java                generic-all
 523 
 524 # Suspect test.png file is left open, windows samevm problems
 525 javax/imageio/plugins/png/ITXtTest.java                         generic-all
 526 
 527 # Solaris sparc and others, failed to compile testcase
 528 javax/imageio/metadata/DOML3Node.java                           generic-all
 529 
 530 # One of these tests is leaving file IMGP1001.JPG open, windows samevm
 531 javax/imageio/plugins/jpeg/ConcurrentReadingTest.java           generic-all
 532 javax/imageio/plugins/jpeg/ReadingInterruptionTest.java         generic-all
 533 
 534 # One of these files is missing a close on writer_* files, windows samevm
 535 javax/imageio/plugins/jpeg/ConcurrentWritingTest.java           generic-all
 536 javax/imageio/plugins/jpeg/WritingInterruptionTest.java         generic-all
 537 
 538 # Leaving file test.jpg open, windows samevm
 539 javax/imageio/plugins/jpeg/ReadAsGrayTest.java                  generic-all
 540 
 541 # Missing close on file wbmp*, windows samevm
 542 javax/imageio/plugins/wbmp/CanDecodeTest.java                   generic-all
 543 
 544 # Failures on OpenSolaris, cannot read input files? samevm issues?
 545 javax/imageio/metadata/BooleanAttributes.java                   generic-all
 546 javax/imageio/plugins/bmp/BMPSubsamplingTest.java               generic-all
 547 javax/imageio/plugins/bmp/TopDownTest.java                      generic-all
 548 javax/imageio/plugins/gif/EncodeSubImageTest.java               generic-all
 549 javax/imageio/plugins/gif/GifTransparencyTest.java              generic-all
 550 javax/imageio/plugins/png/GrayPngTest.java                      generic-all
 551 javax/imageio/plugins/png/ItxtUtf8Test.java                     generic-all
 552 javax/imageio/plugins/png/MergeStdCommentTest.java              generic-all
 553 javax/imageio/plugins/png/ShortHistogramTest.java               generic-all
 554 javax/imageio/plugins/shared/BitDepth.java                      generic-all
 555 
 556 # Exclude all javax/print tests, even if they passed, they may need samevm work
 557 
 558 # Times out on solaris-sparc, sparcv9, x64 -server, some on i586 -client
 559 javax/print/attribute/autosense/PrintAutoSenseData.java         generic-all
 560 javax/print/attribute/Chroma.java                               generic-all
 561 javax/print/attribute/CollateAttr.java                          generic-all
 562 javax/print/attribute/PSCopiesFlavorTest.java                   generic-all
 563 javax/print/LookupServices.java                                 generic-all
 564 javax/print/TestRaceCond.java                                   generic-all
 565 
 566 # These tests really require a printer (might all be windows only tests?)
 567 javax/print/CheckDupFlavor.java                                 generic-all
 568 javax/print/PrintSE/PrintSE.sh                                  generic-all
 569 javax/print/attribute/ChromaticityValues.java                   generic-all
 570 javax/print/attribute/GetCopiesSupported.java                   generic-all
 571 javax/print/attribute/SidesPageRangesTest.java                  generic-all
 572 javax/print/attribute/SupportedPrintableAreas.java              generic-all
 573 
 574 # Only print test left, excluding just because all print tests have been
 575 javax/print/attribute/MediaMappingsTest.java                    generic-all
 576 
 577 ############################################################################
 578 
 579 # jdk_net
 580 
 581 # Suspect many of these tests auffer from using fixed ports, no concrete 
 582 #   evidence.
 583 
 584 # Fails on OpenSolaris, BindException unexpected 
 585 java/net/BindException/Test.java                                generic-all
 586 
 587 # Fails on OpenSolaris, times out
 588 java/net/MulticastSocket/SetOutgoingIf.java                     generic-all
 589 
 590 # Timed out on Solaris 10 X86.
 591 com/sun/net/httpserver/Test3.java                               generic-all
 592 
 593 # Exception in test on windows
 594 com/sun/net/httpserver/bugs/B6373555.java                       windows-all
 595 
 596 # One of these pollutes the samevm on Linux, too many open files, kills jtreg
 597 com/sun/net/httpserver/bugs/B6339483.java                       generic-all
 598 com/sun/net/httpserver/bugs/B6341616.java                       generic-all
 599 
 600 # Suspects in cascading samevm problem, solaris 11 i586 (needs othervm?)
 601 #   Suspect use of setHttps*()?
 602 com/sun/net/httpserver/SelCacheTest.java                        generic-all
 603 com/sun/net/httpserver/Test1.java                               generic-all
 604 com/sun/net/httpserver/Test12.java                              generic-all
 605 com/sun/net/httpserver/Test13.java                              generic-all
 606 com/sun/net/httpserver/Test6a.java                              generic-all
 607 com/sun/net/httpserver/Test7a.java                              generic-all
 608 com/sun/net/httpserver/Test8a.java                              generic-all
 609 com/sun/net/httpserver/Test9.java                               generic-all
 610 com/sun/net/httpserver/Test9a.java                              generic-all
 611 
 612 # 10,000 connections, fails on Linux and makes tests&jtreg fail with samevm
 613 com/sun/net/httpserver/bugs/B6361557.java                       generic-all
 614 
 615 # Address already in use with samevm? Always? Solaris sparc, probably ports
 616 java/net/Authenticator/B4933582.sh                              generic-all
 617 java/net/DatagramSocket/SendSize.java                           generic-all
 618 
 619 # Solaris 11: exception wrong address???
 620 java/net/Inet6Address/B6558853.java                             generic-all
 621 
 622 # Not closing stream on file i6a1, windows samevm problem
 623 java/net/Inet6Address/serialize/Serialize.java                  generic-all
 624 
 625 # Linux x64 fails "network unreachable"?
 626 java/net/ipv6tests/TcpTest.java                                 generic-all
 627 
 628 # Linux i586, fails with unexpected output
 629 java/net/MulticastSocket/NoLoopbackPackets.java                 linux-i586
 630 
 631 # Times out on windows x64, fails with samevm on solaris 11 i586
 632 java/net/ServerSocket/AcceptCauseFileDescriptorLeak.java        generic-all
 633 
 634 # Address already in use
 635 java/net/DatagramSocket/DatagramTimeout.java                    generic-all
 636 
 637 # Fails on windows, takes too long and fails
 638 #   Solaris 10 sparcv9, samevm, java.lang.Exception: Takes too long. Dead lock
 639 java/net/Socket/DeadlockTest.java                               generic-all
 640 
 641 # Linux i586 address already in use or connection error, samevm issues
 642 java/net/Socket/AccurateTimeout.java                            generic-all
 643 java/net/Socket/asyncClose/BrokenPipe.java                      generic-all
 644 java/net/Socket/CloseAvailable.java                             generic-all
 645 java/net/Socket/FDClose.java                                    generic-all
 646 
 647 # Linux X64 address already in use, samevm issues
 648 java/net/Socket/LingerTest.java                                 generic-all
 649 java/net/Socket/LinkLocal.java                                  generic-all
 650 java/net/Socket/NullHost.java                                   generic-all
 651 java/net/Socket/ProxyCons.java                                  generic-all
 652 java/net/Socket/ReadTimeout.java                                generic-all
 653 
 654 # Linux X64 address already in use, samevm issues
 655 java/net/Socket/SetReceiveBufferSize.java                       generic-all
 656 
 657 # Linux i586 address already in use or connection error, samevm issues
 658 java/net/Socket/setReuseAddress/Basic.java                      generic-all
 659 java/net/Socket/setReuseAddress/Restart.java                    generic-all
 660 
 661 # Linux X64 address already in use, samevm issues
 662 java/net/Socket/SetSoLinger.java                                generic-all
 663 
 664 # Address already in use, windows samevm
 665 java/net/Socket/Timeout.java                                    generic-all
 666 
 667 # Linux X64 address already in use, samevm issues
 668 java/net/Socket/ShutdownBoth.java                               generic-all
 669 java/net/Socket/SoTimeout.java                                  generic-all
 670 java/net/Socket/TestClose.java                                  generic-all
 671 java/net/Socket/UrgentDataTest.java                             generic-all
 672 java/net/SocketInputStream/SocketClosedException.java           generic-all
 673 java/net/SocketInputStream/SocketTimeout.java                   generic-all
 674 
 675 # Linux i586, address already in use or timeout, samevm issues
 676 java/net/URLConnection/B5052093.java                            generic-all
 677 java/net/URLConnection/contentHandler/UserContentHandler.java   generic-all
 678 java/net/URLConnection/DisconnectAfterEOF.java                  generic-all
 679 java/net/URLConnection/HandleContentTypeWithAttrs.java          generic-all
 680 java/net/URLConnection/Responses.java                           generic-all
 681 java/net/URLConnection/TimeoutTest.java                         generic-all
 682 java/net/URLConnection/ZeroContentLength.java                   generic-all
 683 
 684 # Solaris 11 i586 fails with samevm, not sure why
 685 java/net/Authenticator/B4769350.java                            generic-all
 686 java/net/HttpURLConnection/HttpResponseCode.java                generic-all
 687 java/net/ResponseCache/B6181108.java                            generic-all
 688 java/net/ResponseCache/ResponseCacheTest.java                   generic-all
 689 java/net/URL/GetContent.java                                    generic-all
 690 java/net/URL/TestIPv6Addresses.java                             generic-all
 691 java/net/URLClassLoader/HttpTest.java                           generic-all
 692 java/net/URLConnection/HttpContinueStackOverflow.java           generic-all
 693 java/net/URLConnection/Redirect307Test.java                     generic-all
 694 java/net/URLConnection/RedirectLimit.java                       generic-all
 695 java/net/URLConnection/ResendPostBody.java                      generic-all
 696 java/net/URL/OpenStream.java                                    generic-all
 697 java/net/URLClassLoader/ClassLoad.java                          generic-all
 698 java/net/URLConnection/SetIfModifiedSince.java                  generic-all
 699 java/net/URLConnection/URLConnectionHeaders.java                generic-all
 700 
 701 # Linux i586 Connection refused or address already in use, samevm issues
 702 sun/net/ftp/B6427768.java                                       generic-all
 703 sun/net/ftp/FtpGetContent.java                                  generic-all
 704 sun/net/ftp/FtpURL.java                                         generic-all
 705 
 706 # Failed on solaris 10 i586, Exception: should have gotten HttpRetryException?
 707 sun/net/www/http/ChunkedOutputStream/Test.java                  generic-all
 708 
 709 # Trouble cleaning up threads in samevm mode on solaris 11 i586
 710 sun/net/www/http/HttpClient/ProxyTest.java                      generic-all
 711 sun/net/www/http/ChunkedInputStream/ChunkedEncodingTest.java    generic-all
 712 sun/net/www/http/ChunkedInputStream/ChunkedEncodingWithProgressMonitorTest.java generic-all
 713 sun/net/www/http/HttpClient/B6726695.java                       generic-all
 714 sun/net/www/http/HttpClient/MultiThreadTest.java                generic-all
 715 sun/net/www/http/KeepAliveCache/KeepAliveTimerThread.java       generic-all
 716 
 717 # Connection refused, windows samevm
 718 sun/net/www/protocol/http/DigestTest.java                       generic-all
 719 
 720 ############################################################################
 721 
 722 # jdk_nio
 723 
 724 # Suspect many of these tests auffer from using fixed ports, no concrete 
 725 #   evidence.
 726 
 727 # Fails on OpenSolaris, IllegalStateException: Cannot add or remove addresses 
 728 #    from a channel that is bound to the wildcard address
 729 com/sun/nio/sctp/SctpChannel/Bind.java                          generic-all
 730 
 731 # Failed on OpenSolaris, java.lang.AssertionError: Unknown event type
 732 com/sun/nio/sctp/SctpChannel/Receive.java                       generic-all
 733 
 734 # Triggers a hotspot crash on Fedora 9 32bit -server and Windows X64  samevm
 735 sun/nio/cs/TestUTF8.java                                        generic-all
 736 
 737 # Solaris sparc, socket timeout
 738 java/nio/channels/spi/SelectorProvider/inheritedChannel/run_tests.sh generic-all
 739 
 740 # Runtime exception on windows X64, samevm mode
 741 java/nio/channels/Selector/WakeupNow.java                       generic-all
 742 
 743 # Occasional errors, solarix x86, address already in use, othervm mode
 744 java/nio/channels/Selector/SelectorTest.java                    generic-all
 745 
 746 # Fails on Linux Fedora 9 X64
 747 sun/nio/cs/FindDecoderBugs.java                                 generic-all
 748 
 749 # Solaris 11 gave assert error and "connection refused", samevm issues?
 750 com/sun/nio/sctp/SctpServerChannel/NonBlockingAccept.java       generic-all
 751 
 752 # Fails with othervm on solaris 11 i586
 753 com/sun/nio/sctp/SctpChannel/CommUp.java                        generic-all
 754 com/sun/nio/sctp/SctpChannel/Connect.java                       generic-all
 755 com/sun/nio/sctp/SctpMultiChannel/Branch.java                   generic-all
 756 com/sun/nio/sctp/SctpMultiChannel/Send.java                     generic-all
 757 com/sun/nio/sctp/SctpMultiChannel/SocketOptionTests.java        generic-all
 758 
 759 # Linux 64bit failures. too many files open
 760 java/nio/channels/Selector/HelperSlowToDie.java                 generic-all
 761 
 762 # Timeouts etc. on Window
 763 java/nio/channels/AsyncCloseAndInterrupt.java                   windows-all
 764 
 765 # Gets java.lang.ExceptionInInitializerError on windows: (Windows 2000 only?)
 766 java/nio/channels/AsynchronousChannelGroup/Basic.java           windows-5.0
 767 java/nio/channels/AsynchronousChannelGroup/GroupOfOne.java      windows-5.0
 768 java/nio/channels/AsynchronousChannelGroup/Identity.java        windows-5.0
 769 java/nio/channels/AsynchronousChannelGroup/Restart.java         windows-5.0
 770 java/nio/channels/AsynchronousDatagramChannel/Basic.java        windows-5.0
 771 java/nio/channels/AsynchronousFileChannel/Lock.java             windows-5.0
 772 java/nio/channels/AsynchronousServerSocketChannel/Basic.java    windows-5.0
 773 java/nio/channels/AsynchronousServerSocketChannel/WithSecurityManager.java windows-5.0
 774 java/nio/channels/AsynchronousSocketChannel/Basic.java          windows-5.0
 775 java/nio/channels/AsynchronousSocketChannel/DieBeforeComplete.java windows-5.0
 776 java/nio/channels/AsynchronousSocketChannel/Leaky.java          windows-5.0
 777 java/nio/channels/AsynchronousSocketChannel/StressLoopback.java windows-5.0
 778 java/nio/channels/Channels/Basic2.java                          windows-5.0
 779 
 780 # Solaris sparc timeout
 781 java/nio/channels/DatagramChannel/Connect.java                  generic-all
 782 
 783 # Solaris i586 timeouts
 784 java/nio/channels/DatagramChannel/EmptyBuffer.java              solaris-all
 785 
 786 # Failed loopback connection? On windows 32bit? 
 787 #   Considered a stress test, can consume all resources.
 788 java/nio/channels/Selector/LotsOfChannels.java                  generic-all
 789 
 790 # Solaris sparcv9, just fails with exception
 791 java/nio/channels/Selector/OpRead.java                          solaris-sparc
 792 
 793 # Windows i586 client, crashed hotspot? Unpredictable
 794 #   Considered a stress test, can consume all resources.
 795 java/nio/channels/Selector/RegAfterPreClose.java                generic-all
 796 
 797 # Solaris i586, cannot assign address, samevm issues
 798 java/nio/channels/Selector/SelectorLimit.java                   generic-all
 799 
 800 # Socket timeout windows X64
 801 java/nio/channels/ServerSocketChannel/AdaptServerSocket.java    windows-all
 802 
 803 # Timeouts etc. on Window
 804 java/nio/channels/SocketChannel/ConnectState.java               windows-all
 805 java/nio/channels/SocketChannel/FinishConnect.java              windows-all
 806 
 807 # Need to be marked othervm, or changed to be samevm safe
 808 java/nio/channels/SocketChannel/OpenLeak.java                   generic-all
 809 
 810 # Gets java.net.BindException alot (static port number?)
 811 java/nio/channels/SocketChannel/VectorIO.java                   generic-all
 812 
 813 # Solaris i586 java.net.BindExceptions
 814 java/nio/channels/SocketChannel/VectorParams.java               solaris-all
 815 
 816 # Linux i586 address already in use, samevm issues
 817 java/nio/channels/SocketChannel/Write.java                      generic-all
 818 
 819 # Fails on all platforms due to overlap of JDK jar file contents:
 820 sun/nio/cs/Test4200310.sh                                       generic-all
 821 
 822 # Depends on motif packages that do not exist all the time:
 823 sun/nio/cs/TestX11CNS.java                                      generic-all
 824 
 825 ############################################################################
 826 
 827 # jdk_rmi
 828 
 829 # Port already in use, fails on sparc, othervm
 830 java/rmi/reliability/benchmark/runRmiBench.sh                   generic-all
 831 
 832 # Already in use port issues? othervm solaris
 833 java/rmi/activation/rmidViaInheritedChannel/InheritedChannelNotServerSocket.java generic-all
 834 java/rmi/activation/rmidViaInheritedChannel/RmidViaInheritedChannel.java generic-all
 835 
 836 # Address already in use, othervm mode, solaris
 837 java/rmi/activation/Activatable/elucidateNoSuchMethod/ElucidateNoSuchMethod.java        generic-all
 838 java/rmi/activation/Activatable/forceLogSnapshot/ForceLogSnapshot.java  generic-all
 839 
 840 # Registry already running on port, solaris
 841 java/rmi/Naming/legalRegistryNames/LegalRegistryNames.java      generic-all
 842 
 843 # Fails on Linux 32 and 64bit -server?, impl not garbage collected???
 844 java/rmi/transport/pinLastArguments/PinLastArguments.java       generic-all
 845 
 846 # Times out on solaris sparc
 847 java/rmi/server/RemoteServer/AddrInUse.java                     generic-all
 848 
 849 # Connection error on Windows i586 -server
 850 #  Also connection errors in othervm on Solaris 10 sparc, same port??? 
 851 sun/rmi/transport/tcp/DeadCachedConnection.java                 generic-all
 852 
 853 # Connection errors in othervm on Solaris 10 sparc, same port??? 
 854 java/rmi/activation/Activatable/checkActivateRef/CheckActivateRef.java generic-all
 855 java/rmi/activation/Activatable/checkAnnotations/CheckAnnotations.java generic-all
 856 java/rmi/activation/Activatable/checkImplClassLoader/CheckImplClassLoader.java generic-all
 857 java/rmi/activation/Activatable/checkRegisterInLog/CheckRegisterInLog.java generic-all
 858 java/rmi/activation/Activatable/createPrivateActivable/CreatePrivateActivatable.java generic-all
 859 java/rmi/activation/Activatable/downloadParameterClass/DownloadParameterClass.java generic-all
 860 java/rmi/activation/Activatable/extLoadedImpl/ext.sh generic-all
 861 java/rmi/activation/Activatable/inactiveGroup/InactiveGroup.java generic-all
 862 java/rmi/activation/Activatable/lookupActivationSystem/LookupActivationSystem.java generic-all
 863 java/rmi/activation/Activatable/nestedActivate/NestedActivate.java generic-all
 864 java/rmi/activation/Activatable/restartCrashedService/RestartCrashedService.java generic-all
 865 java/rmi/activation/Activatable/restartLatecomer/RestartLatecomer.java generic-all
 866 java/rmi/activation/Activatable/shutdownGracefully/ShutdownGracefully.java generic-all
 867 java/rmi/activation/Activatable/unregisterInactive/UnregisterInactive.java generic-all
 868 java/rmi/activation/ActivateFailedException/activateFails/ActivateFails.java generic-all
 869 java/rmi/activation/ActivationGroup/downloadActivationGroup/DownloadActivationGroup.java generic-all
 870 java/rmi/activation/ActivationSystem/activeGroup/IdempotentActiveGroup.java generic-all
 871 java/rmi/reliability/juicer/AppleUserImpl.java generic-all
 872 java/rmi/server/RMISocketFactory/useSocketFactory/unicast/UseCustomSocketFactory.java generic-all
 873 java/rmi/server/UnicastRemoteObject/keepAliveDuringCall/KeepAliveDuringCall.java generic-all
 874 java/rmi/transport/handshakeTimeout/HandshakeTimeout.java generic-all
 875 java/rmi/activation/Activatable/restartService/RestartService.java generic-all
 876 java/rmi/activation/ActivationSystem/modifyDescriptor/ModifyDescriptor.java generic-all
 877 java/rmi/activation/ActivationSystem/stubClassesPermitted/StubClassesPermitted.java generic-all
 878 java/rmi/activation/ActivationSystem/unregisterGroup/UnregisterGroup.java generic-all
 879 java/rmi/activation/CommandEnvironment/SetChildEnv.java generic-all
 880 java/rmi/registry/classPathCodebase/ClassPathCodebase.java generic-all
 881 java/rmi/registry/reexport/Reexport.java generic-all
 882 java/rmi/server/Unreferenced/finiteGCLatency/FiniteGCLatency.java generic-all
 883 java/rmi/server/Unreferenced/leaseCheckInterval/LeaseCheckInterval.java generic-all
 884 java/rmi/server/Unreferenced/unreferencedContext/UnreferencedContext.java generic-all
 885 java/rmi/server/useCustomRef/UseCustomRef.java generic-all
 886 java/rmi/transport/checkFQDN/CheckFQDN.java generic-all
 887 java/rmi/transport/checkLeaseInfoLeak/CheckLeaseLeak.java generic-all
 888 java/rmi/server/RMISocketFactory/useSocketFactory/activatable/UseCustomSocketFactory.java generic-all
 889 java/rmi/server/RMISocketFactory/useSocketFactory/registry/UseCustomSocketFactory.java generic-all
 890 java/rmi/server/UnicastRemoteObject/unexportObject/UnexportLeak.java generic-all
 891 
 892 ############################################################################
 893 
 894 # jdk_security
 895 
 896 # Run too slow on Solaris 10 sparc
 897 sun/security/ssl/com/sun/net/ssl/internal/ssl/InputRecord/SSLSocketTimeoutNulls.java solaris-sparc
 898 sun/security/ssl/com/sun/net/ssl/internal/ssl/SSLSocketImpl/ClientTimeout.java solaris-sparc
 899 sun/security/ssl/com/sun/net/ssl/internal/ssl/SSLSocketImpl/ServerTimeout.java solaris-sparc
 900 sun/security/ssl/sun/net/www/protocol/https/HttpsURLConnection/ReadTimeout.java solaris-sparc
 901 sun/security/ssl/com/sun/net/ssl/internal/ssl/SSLSocketImpl/NotifyHandshakeTest.sh solaris-sparc
 902 sun/security/tools/keytool/AltProviderPath.sh                   solaris-sparc
 903 
 904 # Solaris 10 sparc, passed/failed confusion? java.security.ProviderException: update() failed
 905 sun/security/ssl/com/sun/net/ssl/internal/ssl/SSLSocketImpl/AsyncSSLSocketClose.java generic-all
 906 
 907 # Seem really slow on Solaris sparc, being excluded just for timing reasons
 908 sun/security/tools/jarsigner/AlgOptions.sh                      solaris-sparc
 909 sun/security/tools/jarsigner/nameclash.sh                       solaris-sparc
 910 sun/security/krb5/auto/basic.sh                                 solaris-sparc
 911 sun/security/provider/PolicyFile/getinstance/getinstance.sh     solaris-sparc
 912 sun/security/tools/jarsigner/samename.sh                        solaris-sparc
 913 
 914 # Timed out, Solaris 10 64bit sparcv9
 915 com/sun/crypto/provider/Cipher/DES/PaddingTest.java             generic-all
 916 
 917 # Othervm, sparc, NoRouteToHostException: Cannot assign requested address
 918 sun/security/ssl/javax/net/ssl/NewAPIs/SessionCacheSizeTests.java generic-all
 919 
 920 # ProviderException: sun.security.pkcs11.wrapper.PKCS11Exception: CKR_DEVICE_ERROR
 921 #    Does not seem to run on windows machines? dll missing? 
 922 sun/security/pkcs11/rsa/TestKeyPairGenerator.java               generic-all
 923 
 924 # Times out on windows X64, othervm mode
 925 #    Solaris sparc and sparcv9 -server, timeout
 926 sun/security/ssl/javax/net/ssl/NewAPIs/SessionTimeOutTests.java generic-all
 927 
 928 # Failed on solaris 10 sparc, othervm mode,  "js.jks: No such file or directory"
 929 #  Also, cannot verify signature on solaris i586 -server
 930 sun/security/tools/jarsigner/concise_jarsigner.sh               generic-all
 931 
 932 # Various failures on Linux Fedora 9 X64, othervm mode
 933 lib/security/cacerts/VerifyCACerts.java                         generic-all
 934 sun/security/ssl/javax/net/ssl/NewAPIs/SSLEngine/TestAllSuites.java generic-all
 935 sun/security/ssl/sanity/ciphersuites/CheckCipherSuites.java     generic-all
 936 sun/security/tools/jarsigner/oldsig.sh                          generic-all
 937 
 938 # Various failures on Linux Fedora 9 X64, othervm mode
 939 #   Does not seem to run on windows machines? dll missing? 
 940 sun/security/ssl/sanity/interop/ClientJSSEServerJSSE.java       generic-all
 941 
 942 # Linux i586 -server, buffer too short to hold shared secret?
 943 com/sun/crypto/provider/KeyAgreement/DHKeyAgreement2.java       generic-all
 944 
 945 # Solaris sparcv9: Failed to parse input emptysubject.jks: No such file or directory
 946 sun/security/tools/keytool/emptysubject.sh                      generic-all
 947 
 948 # Timeout on solaris-sparcv9 or exception thrown
 949 com/sun/crypto/provider/Cipher/RSA/TestOAEP_KAT.java            solaris-all
 950 
 951 # File 6535697.test input stream left open? windows samevm
 952 java/security/cert/CertificateFactory/openssl/OpenSSLCert.java  generic-all
 953 
 954 # Leaving file open: SerialVersion.current, windows samevm
 955 java/security/BasicPermission/SerialVersion.java                generic-all
 956 
 957 # Solaris 11 i586, these all fail with samevm, need to be othervm???
 958 java/security/BasicPermission/NullOrEmptyName.java              generic-all
 959 
 960 # Suspect missing close() on file PermClass.current, windows samevm cascade
 961 java/security/BasicPermission/PermClass.java                    generic-all
 962 
 963 # Solaris 11 i586, these all fail with samevm, need to be othervm???
 964 java/security/KeyPairGenerator/Failover.java                    generic-all
 965 java/security/Provider/DefaultPKCS11.java                       generic-all
 966 java/security/SecureClassLoader/DefineClassByteBuffer.java      generic-all
 967 java/security/SecureRandom/GetAlgorithm.java                    generic-all
 968 java/security/Security/removing/RemoveProviders.java            generic-all
 969 java/security/Signature/ByteBuffers.java                        generic-all
 970 java/security/Signature/NONEwithRSA.java                        generic-all
 971 java/security/Signature/SignWithOutputBuffer.java               generic-all
 972 java/security/Signature/TestInitSignWithMyOwnRandom.java        generic-all
 973 java/security/UnresolvedPermission/AccessorMethods.java         generic-all
 974 java/security/UnresolvedPermission/Equals.java                  generic-all
 975 
 976 # Do not seem to run on windows machines? dll missing? 
 977 sun/security/krb5/auto/IgnoreChannelBinding.java                windows-all
 978 
 979 # Fails on OpenSolaris, missing classes, slow on Solaris sparc
 980 sun/security/ec/TestEC.java                                     generic-all
 981 
 982 # Problems with windows x64
 983 sun/security/mscapi/IsSunMSCAPIAvailable.sh                     windows-x64
 984 sun/security/mscapi/RSAEncryptDecrypt.sh                        windows-x64
 985 
 986 # Do not seem to run on windows machines? dll missing? 
 987 sun/security/pkcs11/Cipher/ReinitCipher.java                    windows-all
 988 sun/security/pkcs11/Cipher/TestRSACipher.java                   windows-all
 989 sun/security/pkcs11/Cipher/TestRSACipherWrap.java               windows-all
 990 sun/security/pkcs11/Cipher/TestSymmCiphers.java                 windows-all
 991 sun/security/pkcs11/Cipher/TestSymmCiphersNoPad.java            windows-all
 992 
 993 # Do not seem to run on windows machines? dll missing? 
 994 sun/security/pkcs11/ec/ReadCertificates.java                    windows-all
 995 sun/security/pkcs11/ec/ReadPKCS12.java                          windows-all
 996 sun/security/pkcs11/ec/TestCurves.java                          windows-all
 997 sun/security/pkcs11/ec/TestECDH.java                            windows-all
 998 sun/security/pkcs11/ec/TestECDSA.java                           windows-all
 999 sun/security/pkcs11/ec/TestECGenSpec.java                       windows-all
1000 sun/security/pkcs11/ec/TestKeyFactory.java                      windows-all
1001 sun/security/pkcs11/fips/TrustManagerTest.java                  windows-all
1002 
1003 # Do not seem to run on windows machines? dll missing? 
1004 sun/security/pkcs11/KeyAgreement/TestShort.java                 windows-all
1005 sun/security/pkcs11/KeyGenerator/DESParity.java                 windows-all
1006 
1007 # Exception in test solaris-sparc -client -server, no windows
1008 sun/security/pkcs11/KeyGenerator/TestKeyGenerator.java  windows-all solaris-all
1009 
1010 # Do not seem to run on windows machines? dll missing? 
1011 sun/security/pkcs11/KeyStore/Basic.sh                           windows-all
1012 sun/security/pkcs11/KeyStore/ClientAuth.sh                      windows-all
1013 
1014 # Solaris sparc client, fails to compile?
1015 sun/security/pkcs11/KeyStore/SecretKeysBasic.sh                 solaris-all
1016 
1017 # Do not seem to run on windows machines? dll missing? 
1018 sun/security/pkcs11/Mac/ReinitMac.java                          windows-all
1019 sun/security/pkcs11/MessageDigest/ByteBuffers.java              windows-all
1020 sun/security/pkcs11/MessageDigest/DigestKAT.java                windows-all
1021 sun/security/pkcs11/MessageDigest/ReinitDigest.java             windows-all
1022 sun/security/pkcs11/Provider/ConfigQuotedString.sh              windows-all
1023 sun/security/pkcs11/Provider/Login.sh                           windows-all
1024 sun/security/pkcs11/rsa/KeyWrap.java                            windows-all
1025 sun/security/pkcs11/rsa/TestCACerts.java                        windows-all
1026 sun/security/pkcs11/rsa/TestKeyFactory.java                     windows-all
1027 sun/security/pkcs11/rsa/TestSignatures.java                     windows-all
1028 sun/security/pkcs11/SampleTest.java                             windows-all
1029 sun/security/pkcs11/Secmod/AddPrivateKey.java                   windows-all
1030 sun/security/pkcs11/Secmod/AddTrustedCert.java                  windows-all
1031 sun/security/pkcs11/Secmod/Crypto.java                          windows-all
1032 sun/security/pkcs11/Secmod/GetPrivateKey.java                   windows-all
1033 sun/security/pkcs11/Secmod/JksSetPrivateKey.java                windows-all
1034 sun/security/pkcs11/Secmod/TrustAnchors.java                    windows-all
1035 sun/security/pkcs11/SecureRandom/Basic.java                     windows-all
1036 sun/security/pkcs11/Serialize/SerializeProvider.java            windows-all
1037 sun/security/pkcs11/Signature/ByteBuffers.java                  windows-all
1038 sun/security/pkcs11/Signature/ReinitSignature.java              windows-all
1039 sun/security/pkcs11/Signature/TestDSA.java                      windows-all
1040 sun/security/pkcs11/tls/TestKeyMaterial.java                    windows-all
1041 sun/security/pkcs11/tls/TestMasterSecret.java                   windows-all
1042 sun/security/pkcs11/tls/TestPremaster.java                      windows-all
1043 sun/security/pkcs11/tls/TestPRF.java                            windows-all
1044 
1045 # Fails on OpenSolaris java.net.BindException: Address already in use
1046 sun/security/pkcs11/sslecc/ClientJSSEServerJSSE.java            generic-all
1047 
1048 # Timeout on solaris-sparcv9 or ArrayIndexOutOfBoundsException?
1049 sun/security/rsa/TestKeyPairGeneratorLength.java                solaris-all
1050 sun/security/rsa/TestSignatures.java                            solaris-all
1051 
1052 # Timeout on solaris-sparc and i586 and x64, -client and -server
1053 sun/security/ssl/com/sun/net/ssl/internal/ssl/InputRecord/InterruptedIO.java solaris-all
1054 
1055 # Do not seem to run on windows machines? dll missing? 
1056 sun/security/tools/jarsigner/emptymanifest.sh                   windows-all
1057 
1058 # Files does not exist or no encoding? solaris-sparcv9
1059 sun/security/tools/keytool/importreadall.sh                     solaris-all
1060 sun/security/tools/keytool/selfissued.sh                        solaris-all
1061 
1062 ############################################################################
1063 
1064 # jdk_swing (not using samevm)
1065 
1066 # Fails on solaris 10 sparc, throws RuntimeException that just says "failed"
1067 javax/swing/JLabel/6501991/bug6501991.java                      generic-all
1068 
1069 # Fails on solaris 11 i586, with othervm
1070 javax/swing/JFileChooser/6570445/bug6570445.java                generic-all
1071 javax/swing/JFileChooser/6738668/bug6738668.java                generic-all
1072 javax/swing/JPopupMenu/6675802/bug6675802.java                  generic-all
1073 javax/swing/system/6799345/TestShutdown.java                    generic-all
1074 
1075 ############################################################################
1076 
1077 # jdk_text
1078 
1079 # Linux x64 occasional errors, no details
1080 java/text/Bidi/Bug6665028.java                                  linux-x64
1081 
1082 ############################################################################
1083 
1084 # jdk_tools
1085 
1086 # Some of the tools tests kind of require "othervm" or if they don't will
1087 #  always be firing up another VM anyway due to the nature of tools testing.
1088 #  So most if not all tools tests are now being run with "othervm" mode.
1089 #  Some of these tools tests have a tendency to use fixed ports, bad idea.
1090 
1091 # Output of jps differs from expected output.
1092 #   Invalid argument count on solaris-sparc and x64
1093 sun/tools/jstatd/jstatdPort.sh                                  generic-all
1094 
1095 # othervm mode, Could not synchronize with target
1096 sun/tools/jps/jps-l_1.sh                                        generic-all
1097 sun/tools/jps/jps-l_2.sh                                        generic-all
1098 sun/tools/jps/jps-lm.sh                                         generic-all
1099 sun/tools/jps/jps-Vvml_2.sh                                     generic-all
1100 sun/tools/jps/jps-m_2.sh                                        generic-all
1101 
1102 # Fails on OpenSolaris "Could not synchronize with target"
1103 sun/tools/jps/jps-Defaults.sh                                   generic-all
1104 sun/tools/jps/jps-V_2.sh                                        generic-all
1105 sun/tools/jps/jps-Vm_2.sh                                       generic-all
1106 sun/tools/jps/jps-Vvm.sh                                        generic-all
1107 sun/tools/jps/jps-Vvml.sh                                       generic-all
1108 sun/tools/jps/jps-m.sh                                          generic-all
1109 
1110 # Server name error, port 2098 problem?
1111 sun/tools/jstatd/jstatdServerName.sh                            generic-all
1112 
1113 # These tests fail on solaris sparc, all the time
1114 com/sun/servicetag/DeleteServiceTag.java                        generic-all
1115 com/sun/servicetag/DuplicateNotFound.java                       generic-all
1116 com/sun/servicetag/FindServiceTags.java                         generic-all
1117 com/sun/servicetag/InstanceUrnCheck.java                        generic-all
1118 com/sun/servicetag/InvalidRegistrationData.java                 generic-all
1119 com/sun/servicetag/InvalidServiceTag.java                       generic-all
1120 com/sun/servicetag/JavaServiceTagTest.java                      generic-all
1121 com/sun/servicetag/JavaServiceTagTest1.java                     generic-all
1122 com/sun/servicetag/NewRegistrationData.java                     generic-all
1123 com/sun/servicetag/SystemRegistryTest.java                      generic-all
1124 com/sun/servicetag/TestLoadFromXML.java                         generic-all
1125 com/sun/servicetag/UpdateServiceTagTest.java                    generic-all
1126 com/sun/servicetag/ValidRegistrationData.java                   generic-all
1127 
1128 # Problems on windows, jmap.exe hangs?
1129 com/sun/tools/attach/BasicTests.sh                              windows-all
1130 
1131 # Fails on Solaris 10 sparc, in othervm mode, throws unexpected exception
1132 sun/jvmstat/monitor/MonitoredVm/CR6672135.java                  generic-all
1133 
1134 # Unexpected Monitor Exception, solaris sparc -client
1135 sun/jvmstat/monitor/MonitoredVm/MonitorVmStartTerminate.sh      generic-all
1136 
1137 # Problems on windows, jmap.exe hangs? (these run jmap)
1138 sun/tools/jmap/Basic.sh                                         windows-all
1139 
1140 # Invalid argument count on solaris-sparc and x64
1141 sun/tools/jstatd/jstatdDefaults.sh                              solaris-all
1142 
1143 # Solaris sparcv9, jps output does not match, x64 different
1144 sun/tools/jstatd/jstatdExternalRegistry.sh                      solaris-all
1145 
1146 # Solaris 10 sparc 32bit -client, java.lang.AssertionError: Some tests failed
1147 tools/jar/JarEntryTime.java                                     generic-all
1148 
1149 # Times out on sparc?
1150 tools/launcher/VersionCheck.java                                generic-all
1151 
1152 # These tests fail on solaris sparc, all the time
1153 tools/jar/ChangeDir.java                                        generic-all
1154 
1155 # Cannot write jar
1156 #  Also, possible problems on windows, jmap.exe hangs? 
1157 tools/jar/index/MetaInf.java                                    windows-all
1158 
1159 ############################################################################
1160 
1161 # jdk_util
1162 
1163 # Assert error, failures, on Linux Fedora 9 -server
1164 #   Windows samevm failure, assert error "Passed = 134, failed = 2"
1165 java/util/Arrays/ArrayObjectMethods.java                        generic-all
1166 
1167 # Windows 2000, -client, samevm, java.lang.Error: Completed != 2
1168 java/util/concurrent/locks/ReentrantLock/CancelledLockLoops.java generic-all
1169 
1170 # Windows X64, Executor Stuck samevm mode:
1171 java/util/concurrent/FutureTask/BlockingTaskExecutor.java       generic-all
1172 
1173 # Problems on windows, jmap.exe hangs? (these run jmap), fails on Solaris 10 x86
1174 java/util/concurrent/locks/Lock/TimedAcquireLeak.java           generic-all
1175 
1176 # Solaris sparc client, some failures, "1 not equal to 3"?
1177 #   also Linux problems with samevm mode, -server linux i586? 1 not equal to 3?
1178 java/util/concurrent/Executors/AutoShutdown.java                generic-all
1179 
1180 # Fails on solaris-sparc -server (Set not equal to copy. 1)
1181 java/util/EnumSet/EnumSetBash.java                              solaris-sparc
1182 
1183 # Failing to close an input stream? "foo", triggers samevm windows failures
1184 java/util/Formatter/Constructors.java                           generic-all
1185 
1186 # Need to be marked othervm, or changed to be samevm safe
1187 java/util/Locale/Bug4175998Test.java                            generic-all
1188 java/util/Locale/Bug4184873Test.java                            generic-all
1189 java/util/Locale/LocaleTest.java                                generic-all
1190 
1191 # Need to be marked othervm, or changed to be samevm safe
1192 java/util/logging/GetGlobalTest.java                            generic-all
1193 java/util/logging/LoggerSubclass.java                           generic-all
1194 java/util/logging/LoggingDeadlock.java                          generic-all
1195 java/util/logging/LoggingDeadlock2.java                         generic-all
1196 java/util/logging/LoggingMXBeanTest.java                        generic-all
1197 java/util/logging/LoggingMXBeanTest2.java                       generic-all
1198 java/util/logging/LoggingNIOChange.java                         generic-all
1199 java/util/logging/ParentLoggersTest.java                        generic-all
1200 
1201 # Need to be marked othervm, or changed to be samevm safe
1202 java/util/ResourceBundle/Bug4168625Test.java                    generic-all
1203 java/util/ResourceBundle/Bug6359330.java                        generic-all
1204 java/util/ResourceBundle/TestBug4179766.java                    generic-all
1205 
1206 # Need to be marked othervm, or changed to be samevm safe
1207 java/util/WeakHashMap/GCDuringIteration.java                    generic-all
1208 
1209 # Possible missing input stream close()? Causes samevm issues on windows
1210 java/util/zip/InfoZip.java                                      generic-all
1211 
1212 # Missing a close() on file Test0.zip? windows samevm cascade problem
1213 java/util/zip/ZipFile/Comment.java                              generic-all
1214 
1215 # Suspect missing close() on bad*.zip files, windows cascade errors with samevm
1216 java/util/zip/ZipFile/CorruptedZipFiles.java                    generic-all
1217 
1218 # Should be samevm but causes problems with samevm, no details:
1219 java/util/zip/ZipFile/ManyEntries.java                          generic-all
1220 
1221 ############################################################################
1222