test/ProblemList.txt

Print this page




 414 java/lang/System/finalization/FinThreads.java                   generic-all
 415 java/lang/System/IgnoreNullSecurityManager.java                 generic-all
 416 java/lang/Thread/GenerifyStackTraces.java                       generic-all
 417 java/lang/Thread/StackTraces.java                               generic-all
 418 java/lang/ThreadGroup/Daemon.java                               generic-all
 419 java/lang/ThreadGroup/NullThreadName.java                       generic-all
 420 
 421 # Times out on solaris sparc -server
 422 java/lang/ThreadLocal/MemoryLeak.java                           solaris-all
 423 
 424 # Windows X64, RuntimeException: MyThread expected to have RUNNABLE but got WAITING
 425 java/lang/Thread/ThreadStateTest.java                           generic-all
 426 
 427 # Timeout on windows 64bit 
 428 java/lang/ClassLoader/deadlock/TestCrossDelegate.sh             generic-all
 429 
 430 ############################################################################
 431 
 432 # jdk_management
 433 





 434 # Solaris 10 sparc, NPE from org.omg.stub.javax.management.remote.rmi._RMIConnectionImpl_Tie._invoke
 435 javax/management/remote/mandatory/threads/ExecutorTest.java     generic-all
 436 
 437 # Linux 32bit Fedora 9, IllegalStateException
 438 javax/management/monitor/RuntimeExceptionTest.java              generic-all
 439 
 440 # Problems with rmi connection, othervm  
 441 javax/management/remote/mandatory/subjectDelegation/SubjectDelegation2Test.java generic-all
 442 
 443 # Fails with port already in use
 444 sun/management/jmxremote/bootstrap/SSLConfigFilePermissionTest.sh generic-all
 445 
 446 # Fails with port already in use
 447 sun/management/jmxremote/bootstrap/RmiRegistrySslTest.sh        generic-all
 448 
 449 # Windows, connection can't last that long
 450 javax/management/eventService/LeaseTest.java                    generic-all
 451 
 452 # Linux othervm, X64, java.lang.Exception: Failed: ratio=102.4027795593753
 453 javax/management/remote/mandatory/notif/ListenerScaleTest.java  generic-all


 700 
 701 # Linux i586 Connection refused or address already in use, samevm issues
 702 sun/net/ftp/B6427768.java                                       generic-all
 703 sun/net/ftp/FtpGetContent.java                                  generic-all
 704 sun/net/ftp/FtpURL.java                                         generic-all
 705 
 706 # Failed on solaris 10 i586, Exception: should have gotten HttpRetryException?
 707 sun/net/www/http/ChunkedOutputStream/Test.java                  generic-all
 708 
 709 # Trouble cleaning up threads in samevm mode on solaris 11 i586
 710 sun/net/www/http/HttpClient/ProxyTest.java                      generic-all
 711 sun/net/www/http/ChunkedInputStream/ChunkedEncodingTest.java    generic-all
 712 sun/net/www/http/ChunkedInputStream/ChunkedEncodingWithProgressMonitorTest.java generic-all
 713 sun/net/www/http/HttpClient/B6726695.java                       generic-all
 714 sun/net/www/http/HttpClient/MultiThreadTest.java                generic-all
 715 sun/net/www/http/KeepAliveCache/KeepAliveTimerThread.java       generic-all
 716 
 717 # Connection refused, windows samevm
 718 sun/net/www/protocol/http/DigestTest.java                       generic-all
 719 



 720 ############################################################################
 721 
 722 # jdk_nio
 723 
 724 # Suspect many of these tests auffer from using fixed ports, no concrete 
 725 #   evidence.
 726 













































 727 # Fails on OpenSolaris, IllegalStateException: Cannot add or remove addresses 
 728 #    from a channel that is bound to the wildcard address
 729 com/sun/nio/sctp/SctpChannel/Bind.java                          generic-all
 730 
 731 # Failed on OpenSolaris, java.lang.AssertionError: Unknown event type
 732 com/sun/nio/sctp/SctpChannel/Receive.java                       generic-all
 733 
 734 # Triggers a hotspot crash on Fedora 9 32bit -server and Windows X64  samevm
 735 sun/nio/cs/TestUTF8.java                                        generic-all
 736 
 737 # Solaris sparc, socket timeout
 738 java/nio/channels/spi/SelectorProvider/inheritedChannel/run_tests.sh generic-all
 739 
 740 # Runtime exception on windows X64, samevm mode
 741 java/nio/channels/Selector/WakeupNow.java                       generic-all
 742 
 743 # Occasional errors, solarix x86, address already in use, othervm mode
 744 java/nio/channels/Selector/SelectorTest.java                    generic-all
 745 
 746 # Fails on Linux Fedora 9 X64


 876 java/rmi/activation/ActivationSystem/modifyDescriptor/ModifyDescriptor.java generic-all
 877 java/rmi/activation/ActivationSystem/stubClassesPermitted/StubClassesPermitted.java generic-all
 878 java/rmi/activation/ActivationSystem/unregisterGroup/UnregisterGroup.java generic-all
 879 java/rmi/activation/CommandEnvironment/SetChildEnv.java generic-all
 880 java/rmi/registry/classPathCodebase/ClassPathCodebase.java generic-all
 881 java/rmi/registry/reexport/Reexport.java generic-all
 882 java/rmi/server/Unreferenced/finiteGCLatency/FiniteGCLatency.java generic-all
 883 java/rmi/server/Unreferenced/leaseCheckInterval/LeaseCheckInterval.java generic-all
 884 java/rmi/server/Unreferenced/unreferencedContext/UnreferencedContext.java generic-all
 885 java/rmi/server/useCustomRef/UseCustomRef.java generic-all
 886 java/rmi/transport/checkFQDN/CheckFQDN.java generic-all
 887 java/rmi/transport/checkLeaseInfoLeak/CheckLeaseLeak.java generic-all
 888 java/rmi/server/RMISocketFactory/useSocketFactory/activatable/UseCustomSocketFactory.java generic-all
 889 java/rmi/server/RMISocketFactory/useSocketFactory/registry/UseCustomSocketFactory.java generic-all
 890 java/rmi/server/UnicastRemoteObject/unexportObject/UnexportLeak.java generic-all
 891 
 892 ############################################################################
 893 
 894 # jdk_security
 895 







































 896 # Run too slow on Solaris 10 sparc
 897 sun/security/ssl/com/sun/net/ssl/internal/ssl/InputRecord/SSLSocketTimeoutNulls.java solaris-sparc
 898 sun/security/ssl/com/sun/net/ssl/internal/ssl/SSLSocketImpl/ClientTimeout.java solaris-sparc
 899 sun/security/ssl/com/sun/net/ssl/internal/ssl/SSLSocketImpl/ServerTimeout.java solaris-sparc
 900 sun/security/ssl/sun/net/www/protocol/https/HttpsURLConnection/ReadTimeout.java solaris-sparc
 901 sun/security/ssl/com/sun/net/ssl/internal/ssl/SSLSocketImpl/NotifyHandshakeTest.sh solaris-sparc
 902 sun/security/tools/keytool/AltProviderPath.sh                   solaris-sparc
 903 
 904 # Solaris 10 sparc, passed/failed confusion? java.security.ProviderException: update() failed
 905 sun/security/ssl/com/sun/net/ssl/internal/ssl/SSLSocketImpl/AsyncSSLSocketClose.java generic-all
 906 
 907 # Seem really slow on Solaris sparc, being excluded just for timing reasons
 908 sun/security/tools/jarsigner/AlgOptions.sh                      solaris-sparc
 909 sun/security/tools/jarsigner/nameclash.sh                       solaris-sparc
 910 sun/security/krb5/auto/basic.sh                                 solaris-sparc
 911 sun/security/provider/PolicyFile/getinstance/getinstance.sh     solaris-sparc
 912 sun/security/tools/jarsigner/samename.sh                        solaris-sparc
 913 
 914 # Timed out, Solaris 10 64bit sparcv9
 915 com/sun/crypto/provider/Cipher/DES/PaddingTest.java             generic-all


1071 javax/swing/JFileChooser/6738668/bug6738668.java                generic-all
1072 javax/swing/JPopupMenu/6675802/bug6675802.java                  generic-all
1073 javax/swing/system/6799345/TestShutdown.java                    generic-all
1074 
1075 ############################################################################
1076 
1077 # jdk_text
1078 
1079 # Linux x64 occasional errors, no details
1080 java/text/Bidi/Bug6665028.java                                  linux-x64
1081 
1082 ############################################################################
1083 
1084 # jdk_tools
1085 
1086 # Some of the tools tests kind of require "othervm" or if they don't will
1087 #  always be firing up another VM anyway due to the nature of tools testing.
1088 #  So most if not all tools tests are now being run with "othervm" mode.
1089 #  Some of these tools tests have a tendency to use fixed ports, bad idea.
1090 







1091 # Output of jps differs from expected output.
1092 #   Invalid argument count on solaris-sparc and x64
1093 sun/tools/jstatd/jstatdPort.sh                                  generic-all
1094 
1095 # othervm mode, Could not synchronize with target
1096 sun/tools/jps/jps-l_1.sh                                        generic-all
1097 sun/tools/jps/jps-l_2.sh                                        generic-all
1098 sun/tools/jps/jps-lm.sh                                         generic-all
1099 sun/tools/jps/jps-Vvml_2.sh                                     generic-all
1100 sun/tools/jps/jps-m_2.sh                                        generic-all
1101 





1102 # Fails on OpenSolaris "Could not synchronize with target"
1103 sun/tools/jps/jps-Defaults.sh                                   generic-all
1104 sun/tools/jps/jps-V_2.sh                                        generic-all
1105 sun/tools/jps/jps-Vm_2.sh                                       generic-all
1106 sun/tools/jps/jps-Vvm.sh                                        generic-all
1107 sun/tools/jps/jps-Vvml.sh                                       generic-all
1108 sun/tools/jps/jps-m.sh                                          generic-all
1109 
1110 # Server name error, port 2098 problem?
1111 sun/tools/jstatd/jstatdServerName.sh                            generic-all
1112 
1113 # These tests fail on solaris sparc, all the time
1114 com/sun/servicetag/DeleteServiceTag.java                        generic-all
1115 com/sun/servicetag/DuplicateNotFound.java                       generic-all
1116 com/sun/servicetag/FindServiceTags.java                         generic-all
1117 com/sun/servicetag/InstanceUrnCheck.java                        generic-all
1118 com/sun/servicetag/InvalidRegistrationData.java                 generic-all
1119 com/sun/servicetag/InvalidServiceTag.java                       generic-all
1120 com/sun/servicetag/JavaServiceTagTest.java                      generic-all
1121 com/sun/servicetag/JavaServiceTagTest1.java                     generic-all


1143 # Solaris sparcv9, jps output does not match, x64 different
1144 sun/tools/jstatd/jstatdExternalRegistry.sh                      solaris-all
1145 
1146 # Solaris 10 sparc 32bit -client, java.lang.AssertionError: Some tests failed
1147 tools/jar/JarEntryTime.java                                     generic-all
1148 
1149 # Times out on sparc?
1150 tools/launcher/VersionCheck.java                                generic-all
1151 
1152 # These tests fail on solaris sparc, all the time
1153 tools/jar/ChangeDir.java                                        generic-all
1154 
1155 # Cannot write jar
1156 #  Also, possible problems on windows, jmap.exe hangs? 
1157 tools/jar/index/MetaInf.java                                    windows-all
1158 
1159 ############################################################################
1160 
1161 # jdk_util
1162 












1163 # Assert error, failures, on Linux Fedora 9 -server
1164 #   Windows samevm failure, assert error "Passed = 134, failed = 2"
1165 java/util/Arrays/ArrayObjectMethods.java                        generic-all
1166 
1167 # Windows 2000, -client, samevm, java.lang.Error: Completed != 2
1168 java/util/concurrent/locks/ReentrantLock/CancelledLockLoops.java generic-all
1169 
1170 # Windows X64, Executor Stuck samevm mode:
1171 java/util/concurrent/FutureTask/BlockingTaskExecutor.java       generic-all
1172 
1173 # Problems on windows, jmap.exe hangs? (these run jmap), fails on Solaris 10 x86
1174 java/util/concurrent/locks/Lock/TimedAcquireLeak.java           generic-all
1175 
1176 # Solaris sparc client, some failures, "1 not equal to 3"?
1177 #   also Linux problems with samevm mode, -server linux i586? 1 not equal to 3?
1178 java/util/concurrent/Executors/AutoShutdown.java                generic-all
1179 
1180 # Fails on solaris-sparc -server (Set not equal to copy. 1)
1181 java/util/EnumSet/EnumSetBash.java                              solaris-sparc
1182 




 414 java/lang/System/finalization/FinThreads.java                   generic-all
 415 java/lang/System/IgnoreNullSecurityManager.java                 generic-all
 416 java/lang/Thread/GenerifyStackTraces.java                       generic-all
 417 java/lang/Thread/StackTraces.java                               generic-all
 418 java/lang/ThreadGroup/Daemon.java                               generic-all
 419 java/lang/ThreadGroup/NullThreadName.java                       generic-all
 420 
 421 # Times out on solaris sparc -server
 422 java/lang/ThreadLocal/MemoryLeak.java                           solaris-all
 423 
 424 # Windows X64, RuntimeException: MyThread expected to have RUNNABLE but got WAITING
 425 java/lang/Thread/ThreadStateTest.java                           generic-all
 426 
 427 # Timeout on windows 64bit 
 428 java/lang/ClassLoader/deadlock/TestCrossDelegate.sh             generic-all
 429 
 430 ############################################################################
 431 
 432 # jdk_management
 433 
 434 # Fails on Windows 2000, Test failed for iiop java.lang.NullPointerException
 435 #  at org.omg.stub.javax.management.remote.rmi._RMIConnectionImpl_Tie._invoke(Unknown Source)
 436 #  at com.sun.corba.se.impl.protocol.CorbaServerRequestDispatcherImpl.dispatchToServant(CorbaServerRequestDispatcherImpl.java:653)
 437 javax/management/remote/mandatory/connection/ReconnectTest.java generic-all
 438 
 439 # Solaris 10 sparc, NPE from org.omg.stub.javax.management.remote.rmi._RMIConnectionImpl_Tie._invoke
 440 javax/management/remote/mandatory/threads/ExecutorTest.java     generic-all
 441 
 442 # Linux 32bit Fedora 9, IllegalStateException
 443 javax/management/monitor/RuntimeExceptionTest.java              generic-all
 444 
 445 # Problems with rmi connection, othervm  
 446 javax/management/remote/mandatory/subjectDelegation/SubjectDelegation2Test.java generic-all
 447 
 448 # Fails with port already in use
 449 sun/management/jmxremote/bootstrap/SSLConfigFilePermissionTest.sh generic-all
 450 
 451 # Fails with port already in use
 452 sun/management/jmxremote/bootstrap/RmiRegistrySslTest.sh        generic-all
 453 
 454 # Windows, connection can't last that long
 455 javax/management/eventService/LeaseTest.java                    generic-all
 456 
 457 # Linux othervm, X64, java.lang.Exception: Failed: ratio=102.4027795593753
 458 javax/management/remote/mandatory/notif/ListenerScaleTest.java  generic-all


 705 
 706 # Linux i586 Connection refused or address already in use, samevm issues
 707 sun/net/ftp/B6427768.java                                       generic-all
 708 sun/net/ftp/FtpGetContent.java                                  generic-all
 709 sun/net/ftp/FtpURL.java                                         generic-all
 710 
 711 # Failed on solaris 10 i586, Exception: should have gotten HttpRetryException?
 712 sun/net/www/http/ChunkedOutputStream/Test.java                  generic-all
 713 
 714 # Trouble cleaning up threads in samevm mode on solaris 11 i586
 715 sun/net/www/http/HttpClient/ProxyTest.java                      generic-all
 716 sun/net/www/http/ChunkedInputStream/ChunkedEncodingTest.java    generic-all
 717 sun/net/www/http/ChunkedInputStream/ChunkedEncodingWithProgressMonitorTest.java generic-all
 718 sun/net/www/http/HttpClient/B6726695.java                       generic-all
 719 sun/net/www/http/HttpClient/MultiThreadTest.java                generic-all
 720 sun/net/www/http/KeepAliveCache/KeepAliveTimerThread.java       generic-all
 721 
 722 # Connection refused, windows samevm
 723 sun/net/www/protocol/http/DigestTest.java                       generic-all
 724 
 725 # Fails on Fedora 9 32bit & 64bit & Solaris 10, wrong proxy for http://localhost/index.html
 726 java/net/ProxySelector/B6737819.java                            generic-all
 727 
 728 ############################################################################
 729 
 730 # jdk_nio
 731 
 732 # Suspect many of these tests auffer from using fixed ports, no concrete 
 733 #   evidence.
 734 
 735 # Fails on Windows 2000, Can't delete test directory .\x.SetLastModified.dir
 736 #    at SetLastModified.main(SetLastModified.java:107)
 737 java/io/File/SetLastModified.java                               generic-all
 738 
 739 # Fails on Solaris 10 x64, address already in use
 740 java/nio/channels/DatagramChannel/SRTest.java                   generic-all
 741 
 742 # Fails on Solaris 10 x86, times out
 743 java/nio/channels/DatagramChannel/Sender.java                   generic-all
 744 
 745 # Fails on Fedora 9 x86, address in use
 746 java/nio/channels/Selector/SelectWrite.java                     generic-all
 747 
 748 # Fails on Fedora 9 32bit times out
 749 java/nio/channels/DatagramChannel/EmptyBuffer.java              generic-all
 750 
 751 # Fails on Fedora 9 32bit -server, 
 752 #    RuntimeException: Expected message not recieved
 753 #    at MulticastSendReceiveTests.java:92
 754 java/nio/channels/DatagramChannel/MulticastSendReceiveTests.java generic-all
 755 
 756 # Fails on Solaris 10 x86
 757 #  java.lang.Exception: Stack trace
 758 #    at java.lang.Thread.dumpStack(Thread.java:1353)
 759 #    at MOAT.fail(MOAT.java:1169)
 760 #    at MOAT.check(MOAT.java:1172)
 761 #    at MOAT.checkFunctionalInvariants(MOAT.java:328)
 762 #    at MOAT.checkFunctionalInvariants(MOAT.java:793)
 763 #    at MOAT.testMap(MOAT.java:833)
 764 #    at MOAT.realMain(MOAT.java:89)
 765 java/util/Collection/MOAT.java                                  generic-all
 766 
 767 # Fails on Fedora 9 64bit, RuntimeException: 
 768 #    java.util.concurrent.ExecutionException: 
 769 #    java.net.NoRouteToHostException: No route to host
 770 #  at Basic.testCloseWhenPending(Basic.java:241) at Basic.main(Basic.java:46)
 771 java/nio/channels/AsynchronousSocketChannel/Basic.java          generic-all
 772 
 773 # Fails on Windows 2000, ExceptionInInitializerError
 774 #   in WindowsAsynchronousServerSocketChannelImpl.java:316
 775 java/nio/channels/AsynchronousChannelGroup/Unbounded.java       generic-all
 776 
 777 # Fails on Windows 2000,  times out
 778 java/nio/channels/FileChannel/Transfer.java                     generic-all
 779 
 780 # Fails on OpenSolaris, IllegalStateException: Cannot add or remove addresses 
 781 #    from a channel that is bound to the wildcard address
 782 com/sun/nio/sctp/SctpChannel/Bind.java                          generic-all
 783 
 784 # Failed on OpenSolaris, java.lang.AssertionError: Unknown event type
 785 com/sun/nio/sctp/SctpChannel/Receive.java                       generic-all
 786 
 787 # Triggers a hotspot crash on Fedora 9 32bit -server and Windows X64  samevm
 788 sun/nio/cs/TestUTF8.java                                        generic-all
 789 
 790 # Solaris sparc, socket timeout
 791 java/nio/channels/spi/SelectorProvider/inheritedChannel/run_tests.sh generic-all
 792 
 793 # Runtime exception on windows X64, samevm mode
 794 java/nio/channels/Selector/WakeupNow.java                       generic-all
 795 
 796 # Occasional errors, solarix x86, address already in use, othervm mode
 797 java/nio/channels/Selector/SelectorTest.java                    generic-all
 798 
 799 # Fails on Linux Fedora 9 X64


 929 java/rmi/activation/ActivationSystem/modifyDescriptor/ModifyDescriptor.java generic-all
 930 java/rmi/activation/ActivationSystem/stubClassesPermitted/StubClassesPermitted.java generic-all
 931 java/rmi/activation/ActivationSystem/unregisterGroup/UnregisterGroup.java generic-all
 932 java/rmi/activation/CommandEnvironment/SetChildEnv.java generic-all
 933 java/rmi/registry/classPathCodebase/ClassPathCodebase.java generic-all
 934 java/rmi/registry/reexport/Reexport.java generic-all
 935 java/rmi/server/Unreferenced/finiteGCLatency/FiniteGCLatency.java generic-all
 936 java/rmi/server/Unreferenced/leaseCheckInterval/LeaseCheckInterval.java generic-all
 937 java/rmi/server/Unreferenced/unreferencedContext/UnreferencedContext.java generic-all
 938 java/rmi/server/useCustomRef/UseCustomRef.java generic-all
 939 java/rmi/transport/checkFQDN/CheckFQDN.java generic-all
 940 java/rmi/transport/checkLeaseInfoLeak/CheckLeaseLeak.java generic-all
 941 java/rmi/server/RMISocketFactory/useSocketFactory/activatable/UseCustomSocketFactory.java generic-all
 942 java/rmi/server/RMISocketFactory/useSocketFactory/registry/UseCustomSocketFactory.java generic-all
 943 java/rmi/server/UnicastRemoteObject/unexportObject/UnexportLeak.java generic-all
 944 
 945 ############################################################################
 946 
 947 # jdk_security
 948 
 949 # Fails on Solaris 10 X64, address already in use
 950 sun/security/krb5/auto/HttpNegotiateServer.java                 generic-all
 951 
 952 # Fails on almost all platforms
 953 #   java.lang.UnsupportedClassVersionError: SerialTest : 
 954 #      Unsupported major.minor version 51.0
 955 #    at java.lang.ClassLoader.defineClass1(Native Method)
 956 sun/security/util/Oid/S11N.sh                                   generic-all
 957 
 958 # Fails on Fedora 9 32bit
 959 #  GSSException: Failure unspecified at GSS-API level (Mechanism level: 
 960 #    Invalid argument (400) - Cannot find key of appropriate type to decrypt 
 961 #    AP REP - DES CBC mode with MD5)
 962 #  at sun.security.jgss.krb5.Krb5Context.acceptSecContext(Krb5Context.java:778)
 963 sun/security/krb5/auto/NonMutualSpnego.java                     generic-all
 964 
 965 # Fails on Solaris 10 sparc, GSSException: Failure unspecified at GSS-API level
 966 #   Also fails on Windows 2000 similar way
 967 sun/security/krb5/auto/ok-as-delegate.sh                        generic-all
 968 
 969 # Fails on Windows 2000, GSSException: Failure unspecified at GSS-API level
 970 #    (Mechanism level: Request is a replay (34))
 971 sun/security/krb5/auto/ok-as-delegate-xrealm.sh                 generic-all
 972 
 973 # Fails on Windows 2000, ExceptionInInitializerError
 974 sun/security/mscapi/AccessKeyStore.sh                           generic-all
 975 
 976 # Fails on Windows 2000, UnsatisfiedLinkError: libnspr4.dll: Access is denied
 977 sun/security/pkcs11/KeyAgreement/TestDH.java                    generic-all
 978 
 979 # Fails on Windows 2000, UnsatisfiedLinkError: libnspr4.dll: Access is denied
 980 sun/security/pkcs11/fips/ClientJSSEServerJSSE.java              generic-all
 981 
 982 # Fails on Solaris 10, KrbException: Additional pre-authentication required (25)
 983 sun/security/krb5/auto/basic.sh                                 generic-all
 984 
 985 # Fails on Fedora 9 64bit, PKCS11Exception: CKR_DEVICE_ERROR
 986 sun/security/pkcs11/KeyAgreement/TestDH.java                    generic-all
 987 
 988 # Run too slow on Solaris 10 sparc
 989 sun/security/ssl/com/sun/net/ssl/internal/ssl/InputRecord/SSLSocketTimeoutNulls.java solaris-sparc
 990 sun/security/ssl/com/sun/net/ssl/internal/ssl/SSLSocketImpl/ClientTimeout.java solaris-sparc
 991 sun/security/ssl/com/sun/net/ssl/internal/ssl/SSLSocketImpl/ServerTimeout.java solaris-sparc
 992 sun/security/ssl/sun/net/www/protocol/https/HttpsURLConnection/ReadTimeout.java solaris-sparc
 993 sun/security/ssl/com/sun/net/ssl/internal/ssl/SSLSocketImpl/NotifyHandshakeTest.sh solaris-sparc
 994 sun/security/tools/keytool/AltProviderPath.sh                   solaris-sparc
 995 
 996 # Solaris 10 sparc, passed/failed confusion? java.security.ProviderException: update() failed
 997 sun/security/ssl/com/sun/net/ssl/internal/ssl/SSLSocketImpl/AsyncSSLSocketClose.java generic-all
 998 
 999 # Seem really slow on Solaris sparc, being excluded just for timing reasons
1000 sun/security/tools/jarsigner/AlgOptions.sh                      solaris-sparc
1001 sun/security/tools/jarsigner/nameclash.sh                       solaris-sparc
1002 sun/security/krb5/auto/basic.sh                                 solaris-sparc
1003 sun/security/provider/PolicyFile/getinstance/getinstance.sh     solaris-sparc
1004 sun/security/tools/jarsigner/samename.sh                        solaris-sparc
1005 
1006 # Timed out, Solaris 10 64bit sparcv9
1007 com/sun/crypto/provider/Cipher/DES/PaddingTest.java             generic-all


1163 javax/swing/JFileChooser/6738668/bug6738668.java                generic-all
1164 javax/swing/JPopupMenu/6675802/bug6675802.java                  generic-all
1165 javax/swing/system/6799345/TestShutdown.java                    generic-all
1166 
1167 ############################################################################
1168 
1169 # jdk_text
1170 
1171 # Linux x64 occasional errors, no details
1172 java/text/Bidi/Bug6665028.java                                  linux-x64
1173 
1174 ############################################################################
1175 
1176 # jdk_tools
1177 
1178 # Some of the tools tests kind of require "othervm" or if they don't will
1179 #  always be firing up another VM anyway due to the nature of tools testing.
1180 #  So most if not all tools tests are now being run with "othervm" mode.
1181 #  Some of these tools tests have a tendency to use fixed ports, bad idea.
1182 
1183 # Fails on Fedora 9 32bit, jps output differs problem
1184 sun/tools/jstatd/jstatdDefaults.sh                              generic-all
1185 
1186 # Fails on Linux Fedora 9 32bit, Could not read data for remote JVM 16133
1187 #       jstat output differs from expected output
1188 sun/tools/jstatd/jstatdExternalRegistry.sh                      generic-all
1189 
1190 # Output of jps differs from expected output.
1191 #   Invalid argument count on solaris-sparc and x64
1192 sun/tools/jstatd/jstatdPort.sh                                  generic-all
1193 
1194 # othervm mode, Could not synchronize with target
1195 sun/tools/jps/jps-l_1.sh                                        generic-all
1196 sun/tools/jps/jps-l_2.sh                                        generic-all
1197 sun/tools/jps/jps-lm.sh                                         generic-all
1198 sun/tools/jps/jps-Vvml_2.sh                                     generic-all
1199 sun/tools/jps/jps-m_2.sh                                        generic-all
1200 
1201 # Fails on Solaris 10 sparcv9, shell exits with 1
1202 #  Turning off use of shared archive because of choice of garbage collector or large pages 
1203 #  Could not synchronize with target
1204 sun/tools/jps/jps-v_1.sh                                        generic-all
1205 
1206 # Fails on OpenSolaris "Could not synchronize with target"
1207 sun/tools/jps/jps-Defaults.sh                                   generic-all
1208 sun/tools/jps/jps-V_2.sh                                        generic-all
1209 sun/tools/jps/jps-Vm_2.sh                                       generic-all
1210 sun/tools/jps/jps-Vvm.sh                                        generic-all
1211 sun/tools/jps/jps-Vvml.sh                                       generic-all
1212 sun/tools/jps/jps-m.sh                                          generic-all
1213 
1214 # Server name error, port 2098 problem?
1215 sun/tools/jstatd/jstatdServerName.sh                            generic-all
1216 
1217 # These tests fail on solaris sparc, all the time
1218 com/sun/servicetag/DeleteServiceTag.java                        generic-all
1219 com/sun/servicetag/DuplicateNotFound.java                       generic-all
1220 com/sun/servicetag/FindServiceTags.java                         generic-all
1221 com/sun/servicetag/InstanceUrnCheck.java                        generic-all
1222 com/sun/servicetag/InvalidRegistrationData.java                 generic-all
1223 com/sun/servicetag/InvalidServiceTag.java                       generic-all
1224 com/sun/servicetag/JavaServiceTagTest.java                      generic-all
1225 com/sun/servicetag/JavaServiceTagTest1.java                     generic-all


1247 # Solaris sparcv9, jps output does not match, x64 different
1248 sun/tools/jstatd/jstatdExternalRegistry.sh                      solaris-all
1249 
1250 # Solaris 10 sparc 32bit -client, java.lang.AssertionError: Some tests failed
1251 tools/jar/JarEntryTime.java                                     generic-all
1252 
1253 # Times out on sparc?
1254 tools/launcher/VersionCheck.java                                generic-all
1255 
1256 # These tests fail on solaris sparc, all the time
1257 tools/jar/ChangeDir.java                                        generic-all
1258 
1259 # Cannot write jar
1260 #  Also, possible problems on windows, jmap.exe hangs? 
1261 tools/jar/index/MetaInf.java                                    windows-all
1262 
1263 ############################################################################
1264 
1265 # jdk_util
1266 
1267 # Fails on Fedora 9 64bit, Passed = 6, failed = 1
1268 #   java.lang.Exception: Stack trace
1269 #   at java.lang.Thread.dumpStack(Thread.java:1353)
1270 #   t CoreThreadTimeOut.fail(CoreThreadTimeOut.java:36)
1271 #   at CoreThreadTimeOut.equal(CoreThreadTimeOut.java:41)
1272 #   at CoreThreadTimeOut.main(CoreThreadTimeOut.java:68)
1273 java/util/concurrent/ThreadPoolExecutor/CoreThreadTimeOut.java  generic-all
1274 
1275 # Fails on Fedora 9 32bit & Solaris 10, Error while cleaning up threads after test
1276 #  OOM at times?  Perhaps should be main/othervm?
1277 java/util/concurrent/BlockingQueue/CancelledProducerConsumerLoops.java generic-all
1278 
1279 # Assert error, failures, on Linux Fedora 9 -server
1280 #   Windows samevm failure, assert error "Passed = 134, failed = 2"
1281 java/util/Arrays/ArrayObjectMethods.java                        generic-all
1282 
1283 # Windows 2000, -client, samevm, java.lang.Error: Completed != 2
1284 java/util/concurrent/locks/ReentrantLock/CancelledLockLoops.java generic-all
1285 
1286 # Windows X64, Executor Stuck samevm mode:
1287 java/util/concurrent/FutureTask/BlockingTaskExecutor.java       generic-all
1288 
1289 # Problems on windows, jmap.exe hangs? (these run jmap), fails on Solaris 10 x86
1290 java/util/concurrent/locks/Lock/TimedAcquireLeak.java           generic-all
1291 
1292 # Solaris sparc client, some failures, "1 not equal to 3"?
1293 #   also Linux problems with samevm mode, -server linux i586? 1 not equal to 3?
1294 java/util/concurrent/Executors/AutoShutdown.java                generic-all
1295 
1296 # Fails on solaris-sparc -server (Set not equal to copy. 1)
1297 java/util/EnumSet/EnumSetBash.java                              solaris-sparc
1298